id_mutation,date_mutation,numero_disposition,nature_mutation,valeur_fonciere,adresse_numero,adresse_suffixe,adresse_nom_voie,adresse_code_voie,code_postal,code_commune,nom_commune,code_departement,ancien_code_commune,ancien_nom_commune,id_parcelle,ancien_id_parcelle,numero_volume,lot1_numero,lot1_surface_carrez,lot2_numero,lot2_surface_carrez,lot3_numero,lot3_surface_carrez,lot4_numero,lot4_surface_carrez,lot5_numero,lot5_surface_carrez,nombre_lots,code_type_local,type_local,surface_reelle_bati,nombre_pieces_principales,code_nature_culture,nature_culture,code_nature_culture_speciale,nature_culture_speciale,surface_terrain,longitude,latitude
2019-799262,2019-02-04,000001,Vente,190000,28,B,RUE NEUVE,0070,54290,54567,Villacourt,54,,,545670000G0721,,,,,,,,,,,,,0,1,Maison,166,5,S,sols,,,498,6.346744,48.456279
2019-800185,2019-08-30,000001,Vente,125000,66,,RUE DU MONT,0060,54290,54567,Villacourt,54,,,545670000G0311,,,,,,,,,,,,,0,1,Maison,102,3,S,sols,,,530,6.345601,48.452058
2019-800397,2019-09-30,000001,Vente,205900,,,VILLAGE,B114,54290,54567,Villacourt,54,,,545670000G0145,,,,,,,,,,,,,0,,,,,J,jardins,,,543,6.343944,48.457525
2019-800397,2019-09-30,000001,Vente,205900,8,,RUE NEUVE,0070,54290,54567,Villacourt,54,,,545670000G0146,,,,,,,,,,,,,0,1,Maison,200,5,S,sols,,,242,6.344064,48.457591
2019-800484,2019-10-17,000001,Vente,100000,1,,RUE SADI CARNOT,0020,54290,54567,Villacourt,54,,,545670000G0290,,,,,,,,,,,,,0,4,Local industriel. commercial ou assimilé,220,0,S,sols,,,435,6.348256,48.456023
2019-800484,2019-10-17,000001,Vente,100000,1,,RUE SADI CARNOT,0020,54290,54567,Villacourt,54,,,545670000G0290,,,,,,,,,,,,,0,1,Maison,148,6,S,sols,,,435,6.348256,48.456023
2019-800484,2019-10-17,000001,Vente,100000,,,VILLAGE,B114,54290,54567,Villacourt,54,,,545670000G0680,,,,,,,,,,,,,0,,,,,J,jardins,,,368,6.348135,48.456113
2019-800484,2019-10-17,000001,Vente,100000,,,VILLAGE,B114,54290,54567,Villacourt,54,,,545670000G0680,,,,,,,,,,,,,0,,,,,S,sols,,,73,6.348135,48.456113
2019-800635,2019-11-19,000001,Vente,90000,44,,RUE DU MONT,0060,54290,54567,Villacourt,54,,,545670000G0329,,,,,,,,,,,,,0,1,Maison,120,5,S,sols,,,475,6.346202,48.453509
2019-800635,2019-11-19,000001,Vente,90000,,,VILLAGE MONT,B115,54290,54567,Villacourt,54,,,545670000G0607,,,,,,,,,,,,,0,,,,,P,prés,,,263,6.345816,48.453845
2019-800680,2019-11-18,000001,Vente,62080,16,,RUE DU MONT,0060,54290,54567,Villacourt,54,,,545670000G0360,,,,,,,,,,,,,0,1,Maison,60,2,S,sols,,,439,6.348553,48.454813
2019-800680,2019-11-18,000001,Vente,62080,,,VILLAGE MONT,B115,54290,54567,Villacourt,54,,,545670000G0361,,,,,,,,,,,,,0,,,,,J,jardins,,,603,6.348519,48.454828
2019-800680,2019-11-18,000001,Vente,62080,,,VILLAGE MONT,B115,54290,54567,Villacourt,54,,,545670000G0362,,,,,,,,,,,,,0,,,,,BT,taillis simples,,,43,6.348197,48.455097
