id_mutation,date_mutation,numero_disposition,nature_mutation,valeur_fonciere,adresse_numero,adresse_suffixe,adresse_nom_voie,adresse_code_voie,code_postal,code_commune,nom_commune,code_departement,ancien_code_commune,ancien_nom_commune,id_parcelle,ancien_id_parcelle,numero_volume,lot1_numero,lot1_surface_carrez,lot2_numero,lot2_surface_carrez,lot3_numero,lot3_surface_carrez,lot4_numero,lot4_surface_carrez,lot5_numero,lot5_surface_carrez,nombre_lots,code_type_local,type_local,surface_reelle_bati,nombre_pieces_principales,code_nature_culture,nature_culture,code_nature_culture_speciale,nature_culture_speciale,surface_terrain,longitude,latitude
2019-802651,2019-02-13,000001,Vente,32000,,,AU CHEMIN DE VELOSNES,B015,55600,55034,Bazeilles-sur-Othain,55,,,550340000B0026,,,,,,,,,,,,,0,,,,,J,jardins,POTAG,Jardin potager,265,5.431164,49.497278
2019-802651,2019-02-13,000001,Vente,32000,6,,RUE DE LA PLACE,0045,55600,55034,Bazeilles-sur-Othain,55,,,550340000B0046,,,,,,,,,,,,,0,1,Maison,98,4,S,sols,,,133,5.430954,49.496932
2019-804204,2019-11-14,000001,Vente,157000,2,,RUE SOUS L EGLISE,0005,55600,55034,Bazeilles-sur-Othain,55,,,550340000B0088,,,,,,,,,,,,,0,1,Maison,97,5,S,sols,,,200,5.429359,49.497458
2019-804204,2019-11-14,000001,Vente,157000,2,,RUE SOUS L EGLISE,0005,55600,55034,Bazeilles-sur-Othain,55,,,550340000B0088,,,,,,,,,,,,,0,1,Maison,97,5,P,prés,,,565,5.429359,49.497458
2019-804204,2019-11-14,000001,Vente,157000,2,,RUE SOUS L EGLISE,0005,55600,55034,Bazeilles-sur-Othain,55,,,550340000B0088,,,,,,,,,,,,,0,3,Dépendance,,0,P,prés,,,565,5.429359,49.497458
2019-804204,2019-11-14,000001,Vente,157000,2,,RUE SOUS L EGLISE,0005,55600,55034,Bazeilles-sur-Othain,55,,,550340000B0088,,,,,,,,,,,,,0,3,Dépendance,,0,S,sols,,,200,5.429359,49.497458
2019-804204,2019-11-14,000001,Vente,157000,,,LE VILLAGE,B085,55600,55034,Bazeilles-sur-Othain,55,,,550340000B0089,,,,,,,,,,,,,0,,,,,S,sols,,,65,5.429274,49.49737
2019-804464,2019-12-19,000001,Vente,16464,,,VILLECHAMP,B086,55600,55034,Bazeilles-sur-Othain,55,,,55034000ZB0033,,,,,,,,,,,,,0,,,,,T,terres,,,4490,5.437804,49.5146
2019-804464,2019-12-19,000001,Vente,16464,,,VILLECHAMP,B086,55600,55034,Bazeilles-sur-Othain,55,,,55034000ZB0033,,,,,,,,,,,,,0,,,,,T,terres,,,4490,5.437804,49.5146
