id_mutation,date_mutation,numero_disposition,nature_mutation,valeur_fonciere,adresse_numero,adresse_suffixe,adresse_nom_voie,adresse_code_voie,code_postal,code_commune,nom_commune,code_departement,ancien_code_commune,ancien_nom_commune,id_parcelle,ancien_id_parcelle,numero_volume,lot1_numero,lot1_surface_carrez,lot2_numero,lot2_surface_carrez,lot3_numero,lot3_surface_carrez,lot4_numero,lot4_surface_carrez,lot5_numero,lot5_surface_carrez,nombre_lots,code_type_local,type_local,surface_reelle_bati,nombre_pieces_principales,code_nature_culture,nature_culture,code_nature_culture_speciale,nature_culture_speciale,surface_terrain,longitude,latitude
2019-804690,2019-02-21,000001,Vente,110000,3,,RUE DE LA CROIX,0005,55290,55315,Mandres-en-Barrois,55,,,553150000B0089,,,,,,,,,,,,,0,1,Maison,187,7,S,sols,,,1320,5.387671,48.491821
2019-804690,2019-02-21,000001,Vente,110000,,,LA CROIX DE MISSION,B021,55290,55315,Mandres-en-Barrois,55,,,553150000B1068,,,,,,,,,,,,,0,,,,,S,sols,,,74,5.387473,48.491807
2019-804690,2019-02-21,000001,Vente,110000,,,LA CROIX DE MISSION,B021,55290,55315,Mandres-en-Barrois,55,,,553150000B1068,,,,,,,,,,,,,0,,,,,P,prés,,,1707,5.387473,48.491807
2019-805312,2019-07-26,000001,Vente,4000,,,MANDRES,B055,55290,55315,Mandres-en-Barrois,55,,,553150000B0144,,,,,,,,,,,,,0,,,,,S,sols,,,110,5.391076,48.492123
2019-805313,2019-07-26,000001,Vente,43500,1,,RUE ENTRE DEUX JARDINS,0018,55290,55315,Mandres-en-Barrois,55,,,553150000B0067,,,,,,,,,,,,,0,1,Maison,130,4,S,sols,,,1550,5.390906,48.491147
2019-805314,2019-07-26,000001,Vente,1500,,,SUR L ETANG,B032,55290,55315,Mandres-en-Barrois,55,,,553150000C0711,,,,,,,,,,,,,0,,,,,S,sols,,,487,5.394085,48.491225
2019-805314,2019-07-26,000001,Vente,1500,,,SUR L ETANG,B032,55290,55315,Mandres-en-Barrois,55,,,553150000C0713,,,,,,,,,,,,,0,,,,,VE,vergers,,,2120,5.39453,48.491044
2019-805314,2019-07-26,000001,Vente,1500,,,SUR L ETANG,B032,55290,55315,Mandres-en-Barrois,55,,,553150000C0716,,,,,,,,,,,,,0,,,,,P,prés,,,1465,5.395168,48.49058
2019-805480,2019-09-11,000001,Vente,3000,,,VALLEE DE L ORMANCON,B074,55290,55315,Mandres-en-Barrois,55,,,55315000ZC0029,,,,,,,,,,,,,0,,,,,P,prés,,,7100,5.386671,48.524227
2019-805535,2019-09-25,000001,Vente,2625,,,VALLEE DE L ORMANCON,B074,55290,55315,Mandres-en-Barrois,55,,,55315000ZC0031,,,,,,,,,,,,,0,,,,,P,prés,,,4600,5.387232,48.528112
2019-805719,2019-10-30,000001,Vente,100000,,,LA LOUVIERE,B053,55290,55315,Mandres-en-Barrois,55,,,553150000A0895,,,,,,,,,,,,,0,,,,,VE,vergers,,,535,5.387512,48.49347
2019-805719,2019-10-30,000001,Vente,100000,,,LA LOUVIERE,B053,55290,55315,Mandres-en-Barrois,55,,,553150000A0895,,,,,,,,,,,,,0,,,,,S,sols,,,12,5.387512,48.49347
2019-805719,2019-10-30,000001,Vente,100000,7,,GRANDE ROUTE,0030,55290,55315,Mandres-en-Barrois,55,,,553150000A0896,,,,,,,,,,,,,0,1,Maison,100,4,S,sols,,,549,5.387742,48.493137
