id_mutation,date_mutation,numero_disposition,nature_mutation,valeur_fonciere,adresse_numero,adresse_suffixe,adresse_nom_voie,adresse_code_voie,code_postal,code_commune,nom_commune,code_departement,ancien_code_commune,ancien_nom_commune,id_parcelle,ancien_id_parcelle,numero_volume,lot1_numero,lot1_surface_carrez,lot2_numero,lot2_surface_carrez,lot3_numero,lot3_surface_carrez,lot4_numero,lot4_surface_carrez,lot5_numero,lot5_surface_carrez,nombre_lots,code_type_local,type_local,surface_reelle_bati,nombre_pieces_principales,code_nature_culture,nature_culture,code_nature_culture_speciale,nature_culture_speciale,surface_terrain,longitude,latitude
2019-802536,2019-01-11,000001,Vente,64945.5,15,,RTE DE OSCHES,0030,55220,55498,Souilly,55,,,55498000ZR0066,,,,,,,,,,,,,0,1,Maison,79,4,S,sols,,,1807,5.281859,49.030611
2019-802785,2019-03-07,000001,Vente,40000,34,,VOIE SACREE,0055,55220,55498,Souilly,55,,,55498000AA0119,,,,,,,,,,,,,0,4,Local industriel. commercial ou assimilé,104,0,S,sols,,,95,5.287233,49.029269
2019-803089,2019-04-30,000001,Vente,222600,2,,CHE DE VIGERE,0065,55220,55498,Souilly,55,,,55498000ZH0075,,,,,,,,,,,,,0,1,Maison,130,6,S,sols,,,1200,5.283613,49.031278
2019-803405,2019-07-01,000001,Vente,55104,,,LA WARCHE,B152,55220,55498,Souilly,55,,,55498000ZL0011,,,,,,,,,,,,,0,,,,,T,terres,,,31200,5.304696,49.011568
2019-803528,2019-07-23,000002,Vente,18000,77,,VOIE SACREE,0055,55220,55498,Souilly,55,,,55498000AA0149,,,,,,,,,,,,,0,1,Maison,200,5,,,,,,5.28825,49.031436
2019-803728,2019-08-30,000001,Vente,222000,,,LE VILLAGE,B144,55220,55498,Souilly,55,,,55498000AA0034,,,,,,,,,,,,,0,,,,,J,jardins,POTAG,Jardin potager,943,5.286286,49.029851
2019-803728,2019-08-30,000001,Vente,222000,63,,VOIE SACREE,0055,55220,55498,Souilly,55,,,55498000AA0035,,,,,,,,,,,,,0,1,Maison,225,5,S,sols,,,465,5.286819,49.029618
2019-803776,2019-08-26,000001,Vente,30000,,,LE VILLAGE,B144,55220,55498,Souilly,55,,,55498000AB0021,,,,,,,,,,,,,0,,,,,VE,vergers,,,986,5.284488,49.028422
2019-803776,2019-08-26,000001,Vente,30000,,,LE VILLAGE,B144,55220,55498,Souilly,55,,,55498000AB0022,,,,,,,,,,,,,0,,,,,J,jardins,POTAG,Jardin potager,562,5.285042,49.028259
2019-803776,2019-08-26,000001,Vente,30000,33,,VOIE SACREE,0055,55220,55498,Souilly,55,,,55498000AB0023,,,,,,,,,,,,,0,1,Maison,150,6,S,sols,,,484,5.285474,49.028094
2019-803779,2019-08-30,000001,Vente,40000,4,,RUE DE RECOURT,0045,55220,55498,Souilly,55,,,55498000AB0095,,,,,,,,,,,,,0,1,Maison,116,6,S,sols,,,182,5.285768,49.026989
2019-803779,2019-08-30,000001,Vente,40000,4,,RUE DE RECOURT,0045,55220,55498,Souilly,55,,,55498000AB0095,,,,,,,,,,,,,0,1,Maison,116,6,J,jardins,POTAG,Jardin potager,556,5.285768,49.026989
2019-804353,2019-11-27,000001,Vente,28000,,,LE VILLAGE,B144,55220,55498,Souilly,55,,,55498000AA0127,,,,,,,,,,,,,0,,,,,P,prés,,,1809,5.285579,49.030499
2019-804414,2019-12-02,000001,Vente,175000,,,LE VILLAGE,B144,55220,55498,Souilly,55,,,55498000AB0128,,,,,,,,,,,,,0,,,,,S,sols,,,3,5.284493,49.026407
2019-804414,2019-12-02,000001,Vente,175000,5,,VOIE SACREE,0055,55220,55498,Souilly,55,,,55498000AB0141,,,,,,,,,,,,,0,1,Maison,257,6,S,sols,,,951,5.284118,49.026538
2019-804414,2019-12-02,000001,Vente,175000,,,LA CARPIERE,B016,55220,55498,Souilly,55,,,55498000ZO0034,,,,,,,,,,,,,0,,,,,T,terres,,,7084,5.282975,49.026253
2019-804433,2019-12-09,000001,Vente,45000,,,ST-PIERRE,B124,55220,55498,Souilly,55,,,55498000ZN0009,,,,,,,,,,,,,0,,,,,B,bois,,,29484,5.279158,49.014593
2019-804433,2019-12-09,000001,Vente,45000,,,ST-PIERRE,B124,55220,55498,Souilly,55,,,55498000ZN0009,,,,,,,,,,,,,0,,,,,BT,taillis simples,,,134316,5.279158,49.014593
2019-804524,2019-12-21,000002,Vente,13005,,,LE MAZET,B084,55220,55498,Souilly,55,,,55498000ZR0098,,,,,,,,,,,,,0,,,,,AB,terrains a bâtir,,,867,5.279801,49.031463
