id_mutation,date_mutation,numero_disposition,nature_mutation,valeur_fonciere,adresse_numero,adresse_suffixe,adresse_nom_voie,adresse_code_voie,code_postal,code_commune,nom_commune,code_departement,ancien_code_commune,ancien_nom_commune,id_parcelle,ancien_id_parcelle,numero_volume,lot1_numero,lot1_surface_carrez,lot2_numero,lot2_surface_carrez,lot3_numero,lot3_surface_carrez,lot4_numero,lot4_surface_carrez,lot5_numero,lot5_surface_carrez,nombre_lots,code_type_local,type_local,surface_reelle_bati,nombre_pieces_principales,code_nature_culture,nature_culture,code_nature_culture_speciale,nature_culture_speciale,surface_terrain,longitude,latitude
2019-806545,2019-06-25,000001,Vente,40000,7,,HAMEAU DE MARVOISIN,B027,55300,55586,Xivray-et-Marvoisin,55,,,55586000AB0009,,,,,,,,,,,,,0,1,Maison,107,4,S,sols,,,844,5.749711,48.871189
2019-806566,2019-07-04,000001,Vente,6424,,,GRINIBLE,B025,55300,55586,Xivray-et-Marvoisin,55,,,55586000ZE0081,,,,,,,,,,,,,0,,,,,P,prés,,,16060,5.747029,48.853988
2019-806586,2019-06-27,000001,Vente,46000,14,,RUE DE RITTE,0003,55300,55586,Xivray-et-Marvoisin,55,,,55586000AA0016,,,,,,,,,,,,,0,1,Maison,68,3,S,sols,,,542,5.741789,48.865265
2019-806586,2019-06-27,000001,Vente,46000,14,,RUE DE RITTE,0003,55300,55586,Xivray-et-Marvoisin,55,,,55586000AA0016,,,,,,,,,,,,,0,1,Maison,68,3,VE,vergers,,,801,5.741789,48.865265
2019-806901,2019-10-29,000001,Vente,96300,4,,RUE PRINCIPALE,0002,55300,55586,Xivray-et-Marvoisin,55,,,55586000AA0070,,,,,,,,,,,,,0,1,Maison,98,3,S,sols,,,595,5.74123,48.863171
2019-806901,2019-10-29,000001,Vente,96300,,,PRE LE BRULEUX,B053,55300,55586,Xivray-et-Marvoisin,55,,,55586000ZE0071,,,,,,,,,,,,,0,,,,,P,prés,,,512,5.741467,48.862902
2019-807136,2019-12-20,000001,Vente,18360,,,FREMIER,B021,55300,55586,Xivray-et-Marvoisin,55,,,55586000ZI0002,,,,,,,,,,,,,0,,,,,P,prés,,,12000,5.715706,48.859866
2019-807136,2019-12-20,000001,Vente,18360,,,NEVRECHAMP,B043,55300,55586,Xivray-et-Marvoisin,55,,,55586000ZI0044,,,,,,,,,,,,,0,,,,,P,prés,,,39000,5.714022,48.857637
