id_mutation,date_mutation,numero_disposition,nature_mutation,valeur_fonciere,adresse_numero,adresse_suffixe,adresse_nom_voie,adresse_code_voie,code_postal,code_commune,nom_commune,code_departement,ancien_code_commune,ancien_nom_commune,id_parcelle,ancien_id_parcelle,numero_volume,lot1_numero,lot1_surface_carrez,lot2_numero,lot2_surface_carrez,lot3_numero,lot3_surface_carrez,lot4_numero,lot4_surface_carrez,lot5_numero,lot5_surface_carrez,nombre_lots,code_type_local,type_local,surface_reelle_bati,nombre_pieces_principales,code_nature_culture,nature_culture,code_nature_culture_speciale,nature_culture_speciale,surface_terrain,longitude,latitude
2019-821670,2019-01-04,000001,Vente,73500,,,RUE ALFRED HULL,0008,56400,56167,Plougoumelen,56,,,56167000AC0425,,,,,,,,,,,,,0,,,,,AB,terrains a bâtir,,,427,-2.914708,47.649005
2019-821696,2019-01-16,000001,Vente,7000,,,PRAD GOUAH VARIA,B772,56400,56167,Plougoumelen,56,,,561670000C1055,,,,,,,,,,,,,0,,,,,AG,terrains d'agrément,,,506,-2.857542,47.676219
2019-821703,2019-01-12,000001,Vente,280500,,,KERGANET,B310,56400,56167,Plougoumelen,56,,,561670000F1118,,,,,,,,,,,,,0,1,Maison,104,5,S,sols,,,829,-2.914454,47.634315
2019-821745,2019-01-15,000001,Vente,18000,,,LANN BIHAN,B345,56400,56167,Plougoumelen,56,,,561670000E0114,,,,,,,,,,,,,0,,,,,AG,terrains d'agrément,,,8360,-2.916141,47.659911
2019-821765,2019-01-22,000001,Vente,170000,19,,PL DE L EGLISE,0060,56400,56167,Plougoumelen,56,,,56167000AB0017,,,,,,,,,,,,,0,1,Maison,110,5,S,sols,,,128,-2.918347,47.652608
2019-821840,2019-01-11,000001,Vente,115000,4,,RLE DE L'ANCIEN PRESBYTERE,0141,56400,56167,Plougoumelen,56,,,56167000AC0133,,,,,,,,,,,,,0,1,Maison,60,3,S,sols,,,197,-2.917546,47.652088
2019-821858,2019-01-11,000001,Vente,25000,4,B,RLE DE L'ANCIEN PRESBYTERE,0141,56400,56167,Plougoumelen,56,,,56167000AC0132,,,,,,,,,,,,,0,3,Dépendance,,0,S,sols,,,188,-2.917712,47.652133
2019-821906,2019-01-28,000001,Vente,362200,5589,,MOULIN DU HERIC,B488,56400,56167,Plougoumelen,56,,,561670000F0854,,,,,,,,,,,,,0,1,Maison,147,4,AG,terrains d'agrément,,,1355,-2.912033,47.630621
2019-821906,2019-01-28,000001,Vente,362200,5589,,MOULIN DU HERIC,B488,56400,56167,Plougoumelen,56,,,561670000F0854,,,,,,,,,,,,,0,1,Maison,147,4,S,sols,,,500,-2.912033,47.630621
2019-822001,2019-02-07,000001,Vente,99479.7,,,RUE DES ILES,0026,56400,56167,Plougoumelen,56,,,561670000D1909,,,,,,,,,,,,,0,,,,,AB,terrains a bâtir,,,1219,-2.905596,47.663268
2019-822001,2019-02-07,000001,Vente,99479.7,,,RUE DES ILES,0026,56400,56167,Plougoumelen,56,,,561670000D1910,,,,,,,,,,,,,0,,,,,AB,terrains a bâtir,,,982,-2.90601,47.663214
2019-822003,2019-02-05,000001,Vente,40521.6,5000,,RUE BELLE ILE,0024,56400,56167,Plougoumelen,56,,,561670000D1936,,,,,,,,,,,,,0,4,Local industriel. commercial ou assimilé,240,0,S,sols,,,804,-2.905225,47.663481
2019-822041,2019-02-12,000001,Vente,28332.3,,,BOUHEC ER BUANEC,B044,56400,56167,Plougoumelen,56,,,561670000F0404,,,,,,,,,,,,,0,,,,,J,jardins,,,1460,-2.915083,47.635962
2019-822041,2019-02-12,000001,Vente,28332.3,5464,,KERGANET,B310,56400,56167,Plougoumelen,56,,,561670000F0405,,,,,,,,,,,,,0,1,Maison,98,5,S,sols,,,500,-2.914468,47.635925
2019-822041,2019-02-12,000001,Vente,28332.3,5464,,KERGANET,B310,56400,56167,Plougoumelen,56,,,561670000F0405,,,,,,,,,,,,,0,1,Maison,98,5,AG,terrains d'agrément,,,728,-2.914468,47.635925
2019-822056,2019-02-12,000001,Vente,102902.3,,,MANE GUEN,B477,56400,56167,Plougoumelen,56,,,561670000D1927,,,,,,,,,,,,,0,,,,,AB,terrains a bâtir,,,2263,-2.908015,47.66416
2019-822085,2019-02-12,000001,Vente,197500,5163,C,PENVERN,B717,56400,56167,Plougoumelen,56,,,561670000D0831,,,,,,,,,,,,,0,1,Maison,97,4,BR,futaies résineuses,,,1000,-2.890124,47.655969
2019-822273,2019-03-05,000001,Vente,162472,5627,,TREUSAL,B880,56400,56167,Plougoumelen,56,,,561670000B0764,,,,,,,,,,,,,0,1,Maison,168,6,BT,taillis simples,,,2070,-2.907984,47.674057
2019-822273,2019-03-05,000001,Vente,162472,5627,,TREUSAL,B880,56400,56167,Plougoumelen,56,,,561670000B0764,,,,,,,,,,,,,0,1,Maison,168,6,T,terres,,,16087,-2.907984,47.674057
2019-822273,2019-03-05,000001,Vente,162472,5627,,TREUSAL,B880,56400,56167,Plougoumelen,56,,,561670000B0764,,,,,,,,,,,,,0,1,Maison,168,6,L,landes,,,1042,-2.907984,47.674057
2019-822273,2019-03-05,000001,Vente,162472,5627,,TREUSAL,B880,56400,56167,Plougoumelen,56,,,561670000B0764,,,,,,,,,,,,,0,1,Maison,168,6,P,prés,,,5690,-2.907984,47.674057
2019-822273,2019-03-05,000001,Vente,162472,5627,,TREUSAL,B880,56400,56167,Plougoumelen,56,,,561670000B0764,,,,,,,,,,,,,0,1,Maison,168,6,T,terres,,,2070,-2.907984,47.674057
2019-822273,2019-03-05,000001,Vente,162472,5627,,TREUSAL,B880,56400,56167,Plougoumelen,56,,,561670000B0764,,,,,,,,,,,,,0,1,Maison,168,6,S,sols,,,1890,-2.907984,47.674057
2019-822310,2019-03-08,000001,Vente,51900,,,PRAD ER VELIN,B767,56400,56167,Plougoumelen,56,,,56167000AB0382,,,,,,,,,,,,,0,,,,,AB,terrains a bâtir,,,329,-2.912835,47.652003
2019-822311,2019-03-12,000001,Vente,45000,10,,RUE LEONARD EUNSON,0004,56400,56167,Plougoumelen,56,,,56167000AB0358,,,,,,,,,,,,,0,,,,,AB,terrains a bâtir,,,258,-2.9146,47.651855
2019-822448,2019-03-19,000001,Vente,53880.48,,,MANE GUEN,B477,56400,56167,Plougoumelen,56,,,561670000D1913,,,,,,,,,,,,,0,,,,,AB,terrains a bâtir,,,1136,-2.905714,47.662767
2019-822720,2019-05-07,000001,Vente,273000,5102,,TREMODEC,B878,56400,56167,Plougoumelen,56,,,561670000B0589,,,,,,,,,,,,,0,1,Maison,210,9,AG,terrains d'agrément,,,2906,-2.896324,47.677031
2019-822720,2019-05-07,000001,Vente,273000,,,TREMODEC,B878,56400,56167,Plougoumelen,56,,,561670000B0591,,,,,,,,,,,,,0,,,,,S,sols,,,193,-2.895748,47.676854
2019-822720,2019-05-07,000001,Vente,273000,,,TREMODEC,B878,56400,56167,Plougoumelen,56,,,561670000B0592,,,,,,,,,,,,,0,,,,,S,sols,,,1090,-2.895916,47.676853
2019-822720,2019-05-07,000001,Vente,273000,,,TREMODEC,B878,56400,56167,Plougoumelen,56,,,561670000B0593,,,,,,,,,,,,,0,,,,,S,sols,,,32,-2.896518,47.677071
2019-822772,2019-05-10,000001,Vente,120000,4,,RUE YVES DE PONT SAL,0192,56400,56167,Plougoumelen,56,,,56167000AB0199,,,12,,,,,,,,,,1,3,Dépendance,,0,,,,,,-2.91706,47.652964
2019-822772,2019-05-10,000001,Vente,120000,4,,RUE YVES DE PONT SAL,0192,56400,56167,Plougoumelen,56,,,56167000AB0199,,,4,59.29,,,,,,,,,1,2,Appartement,64,3,,,,,,-2.91706,47.652964
2019-822828,2019-05-21,000001,Vente,130000,,,LANDE DU MOULIN,B331,56400,56167,Plougoumelen,56,,,561670000E0682,,,,,,,,,,,,,0,,,,,T,terres,,,721,-2.927163,47.649221
2019-822868,2019-05-15,000001,Vente,168000,,,PARC MANGLE,B643,56400,56167,Plougoumelen,56,,,56167000AB0166,,,,,,,,,,,,,0,,,,,P,prés,,,309,-2.91171,47.652362
2019-822868,2019-05-15,000001,Vente,168000,6001,,LE STRAQUEN,B855,56400,56167,Plougoumelen,56,,,561670000E0310,,,,,,,,,,,,,0,1,Maison,110,5,S,sols,,,156,-2.911622,47.652598
2019-822868,2019-05-15,000001,Vente,168000,,,LE BOURG,B052,56400,56167,Plougoumelen,56,,,561670000E2062,,,,,,,,,,,,,0,,,,,S,sols,,,28,-2.911635,47.652653
2019-822876,2019-05-29,000001,Vente,255000,,,LOCMARIA,B470,56400,56167,Plougoumelen,56,,,561670000C1107,,,,,,,,,,,,,0,,,,,AG,terrains d'agrément,,,507,-2.864579,47.674843
2019-822876,2019-05-29,000001,Vente,255000,5139,,LOCMARIA,B470,56400,56167,Plougoumelen,56,,,561670000C1109,,,,,,,,,,,,,0,1,Maison,106,4,S,sols,,,718,-2.864689,47.674657
2019-822926,2019-05-16,000001,Vente,268300,2,,RUE JACK BRADDOCK,0003,56400,56167,Plougoumelen,56,,,56167000AB0300,,,,,,,,,,,,,0,1,Maison,100,5,S,sols,,,413,-2.914617,47.651381
2019-822954,2019-05-18,000001,Vente,55000,,,PRAD ER VELIN,B767,56400,56167,Plougoumelen,56,,,56167000AB0381,,,,,,,,,,,,,0,,,,,AB,terrains a bâtir,,,331,-2.91307,47.652041
2019-822982,2019-06-04,000001,Vente,4500,,,PEH BRAS,B704,56400,56167,Plougoumelen,56,,,561670000E1534,,,,,,,,,,,,,0,,,,,T,terres,,,3000,-2.917719,47.665561
2019-822982,2019-06-04,000001,Vente,4500,,,PEH BRAS,B704,56400,56167,Plougoumelen,56,,,561670000E1534,,,,,,,,,,,,,0,,,,,T,terres,,,1343,-2.917719,47.665561
2019-823006,2019-06-06,000001,Vente,90000,15,,RUE DES CHENES,0040,56400,56167,Plougoumelen,56,,,56167000AC0205,,,,,,,,,,,,,0,1,Maison,84,5,S,sols,,,595,-2.91678,47.650222
2019-823057,2019-06-13,000001,Vente,216167,12,,RUE DE PEN VRAZ,0178,56400,56167,Plougoumelen,56,,,56167000AC0077,,,,,,,,,,,,,0,1,Maison,91,4,S,sols,,,327,-2.921981,47.64954
2019-823075,2019-06-08,000002,Vente,222000,4,,RTE DU MANE HALLATE,0103,56400,56167,Plougoumelen,56,,,561670000G0903,,,,,,,,,,,,,0,1,Maison,109,4,,,,,,-2.896219,47.642565
2019-823300,2019-06-28,000002,Echange,38440,,,LESTREVIAU,B441,56400,56167,Plougoumelen,56,,,561670000F1152,,,,,,,,,,,,,0,,,,,P,prés,,,105,-2.908221,47.642816
2019-823300,2019-06-28,000002,Echange,38440,,,LESTREVIAU,B441,56400,56167,Plougoumelen,56,,,561670000F1153,,,,,,,,,,,,,0,,,,,P,prés,,,98,-2.907996,47.642913
2019-823300,2019-06-28,000002,Echange,38440,,,LESTREVIAU,B441,56400,56167,Plougoumelen,56,,,561670000F1155,,,,,,,,,,,,,0,,,,,P,prés,,,469,-2.907733,47.643218
2019-823328,2019-07-05,000001,Vente,145000,26,,RUE DE TOULBROCH,0166,56400,56167,Plougoumelen,56,,,561670000F0862,,,,,,,,,,,,,0,,,,,T,terres,,,554,-2.909227,47.642658
2019-823328,2019-07-05,000001,Vente,145000,24,,RUE DE TOULBROCH,0166,56400,56167,Plougoumelen,56,,,561670000F0864,,,,,,,,,,,,,0,2,Appartement,47,2,S,sols,,,808,-2.908963,47.642443
2019-823328,2019-07-05,000001,Vente,145000,24,,RUE DE TOULBROCH,0166,56400,56167,Plougoumelen,56,,,561670000F0864,,,,,,,,,,,,,0,2,Appartement,106,5,S,sols,,,808,-2.908963,47.642443
2019-823329,2019-07-05,000001,Vente,142990,18,,RUE DES AUBEPINES,0010,56400,56167,Plougoumelen,56,,,561670000E0725,,,,,,,,,,,,,0,1,Maison,74,3,S,sols,,,520,-2.928898,47.648028
2019-823420,2019-06-28,000001,Vente,85000,,,RUE NOTRE DAME DE BEQUEREL,0117,56400,56167,Plougoumelen,56,,,56167000AC0452,,,,,,,,,,,,,0,,,,,AB,terrains a bâtir,,,500,-2.918588,47.651874
2019-823486,2019-07-11,000001,Vente terrain à bâtir,48000,,,RUE DE L EUROPE,0011,56400,56167,Plougoumelen,56,,,561670000B0474,,,,,,,,,,,,,0,,,,,S,sols,,,374,-2.906446,47.66622
2019-823486,2019-07-11,000001,Vente terrain à bâtir,48000,5000,,RUE DE L EUROPE,0011,56400,56167,Plougoumelen,56,,,561670000B0737,,,,,,,,,,,,,0,4,Local industriel. commercial ou assimilé,1002,0,S,sols,,,628,-2.90618,47.66697
2019-823744,2019-07-19,000001,Vente,240000,12,,RUE JEAN GUEHENNO,0088,56400,56167,Plougoumelen,56,,,56167000AC0238,,,,,,,,,,,,,0,1,Maison,104,5,S,sols,,,567,-2.915969,47.649359
2019-823798,2019-08-22,000001,Vente,353000,5633,,PARC MARION,B648,56400,56167,Plougoumelen,56,,,561670000E1210,,,,,,,,,,,,,0,1,Maison,125,5,S,sols,,,815,-2.913066,47.657603
2019-823926,2019-08-20,000001,Vente,340000,2,,IMP AR BENAL,0009,56400,56167,Plougoumelen,56,,,56167000AC0046,,,,,,,,,,,,,0,1,Maison,100,6,S,sols,,,735,-2.91972,47.651595
2019-823926,2019-08-20,000001,Vente,340000,2,,IMP AR BENAL,0009,56400,56167,Plougoumelen,56,,,56167000AC0046,,,,,,,,,,,,,0,1,Maison,26,2,S,sols,,,735,-2.91972,47.651595
2019-824001,2019-09-11,000001,Vente,285000,12,,RUE SEIH PAZENN,0159,56400,56167,Plougoumelen,56,,,561670000E1207,,,,,,,,,,,,,0,1,Maison,84,4,J,jardins,,,594,-2.919141,47.665354
2019-824001,2019-09-11,000001,Vente,285000,12,,RUE SEIH PAZENN,0159,56400,56167,Plougoumelen,56,,,561670000E1207,,,,,,,,,,,,,0,1,Maison,84,4,S,sols,,,782,-2.919141,47.665354
2019-824029,2019-09-06,000001,Vente,44900,,,BODENO,B034,56400,56167,Plougoumelen,56,,,56167000AB0373,,,,,,,,,,,,,0,,,,,AB,terrains a bâtir,,,244,-2.914139,47.651989
2019-824208,2019-09-21,000001,Vente,302500,12,,RUE PER JAKES HELIAS,0131,56400,56167,Plougoumelen,56,,,56167000AC0250,,,,,,,,,,,,,0,1,Maison,91,4,S,sols,,,611,-2.916693,47.648185
2019-824329,2019-09-26,000001,Vente,6600,,,RUE DE LA RESISTANCE,0147,56400,56167,Plougoumelen,56,,,56167000AB0226,,,,,,,,,,,,,0,,,,,T,terres,,,701,-2.917179,47.655194
2019-824351,2019-10-04,000002,Echange,830,,,PARC BIHAN,B502,56400,56167,Plougoumelen,56,,,561670000G0725,,,,,,,,,,,,,0,,,,,T,terres,,,352,-2.90075,47.642302
2019-824351,2019-10-04,000002,Echange,830,,,PRADEU,B804,56400,56167,Plougoumelen,56,,,561670000G0727,,,,,,,,,,,,,0,,,,,T,terres,,,1303,-2.898916,47.642469
2019-824351,2019-10-04,000003,Echange,830,,,PARC BIHAN,B502,56400,56167,Plougoumelen,56,,,561670000G0730,,,,,,,,,,,,,0,,,,,T,terres,,,736,,
2019-824351,2019-10-04,000003,Echange,830,,,PRADEN,B923,56400,56167,Plougoumelen,56,,,561670000G0732,,,,,,,,,,,,,0,,,,,T,terres,,,925,-2.900107,47.642216
2019-824377,2019-09-26,000001,Vente,250000,9,,RUE DE L EUROPE,0011,56400,56167,Plougoumelen,56,,,561670000C1087,,,,,,,,,,,,,0,4,Local industriel. commercial ou assimilé,1200,0,S,sols,,,3485,-2.899175,47.666496
2019-824448,2019-10-15,000001,Vente,37517.13,,,RUE MOLENE,0025,56400,56167,Plougoumelen,56,,,561670000D1925,,,,,,,,,,,,,0,,,,,AB,terrains a bâtir,,,791,-2.907236,47.663713
2019-824459,2019-10-04,000001,Vente,5000,,,GOUAILLEU,B259,56400,56167,Plougoumelen,56,,,561670000D1417,,,,,,,,,,,,,0,,,,,L,landes,,,365,-2.891642,47.655961
2019-824459,2019-10-04,000001,Vente,5000,,,GOUAILLEU,B259,56400,56167,Plougoumelen,56,,,561670000D1418,,,,,,,,,,,,,0,,,,,T,terres,,,2343,-2.8918,47.656147
2019-824517,2019-10-25,000001,Vente,119560,,,BOUQUELIN,B051,56400,56167,Plougoumelen,56,,,561670000F0155,,,,,,,,,,,,,0,,,,,S,sols,,,1600,-2.908977,47.642074
2019-824517,2019-10-25,000001,Vente,119560,,,LESTREVIAU,B441,56400,56167,Plougoumelen,56,,,561670000F0865,,,,,,,,,,,,,0,,,,,S,sols,,,108,-2.908855,47.64231
2019-824517,2019-10-25,000001,Vente,119560,,,LESTREVIAU,B441,56400,56167,Plougoumelen,56,,,561670000F0866,,,,,,,,,,,,,0,,,,,S,sols,,,1,-2.908999,47.642334
2019-824518,2019-10-25,000002,Vente,440,,,BOUQUELIN,B051,56400,56167,Plougoumelen,56,,,561670000F0516,,,,,,,,,,,,,0,,,,,P,prés,,,277,-2.908541,47.641662
2019-824518,2019-10-25,000002,Vente,440,,,BOUQUELIN,B051,56400,56167,Plougoumelen,56,,,561670000F0517,,,,,,,,,,,,,0,,,,,L,landes,,,598,-2.908661,47.641744
2019-824590,2019-10-30,000001,Vente,600000,,,RUE DU MORBIHAN,0021,56400,56167,Plougoumelen,56,,,561670000C0764,,,,,,,,,,,,,0,,,,,S,sols,,,216,-2.899355,47.665735
2019-824590,2019-10-30,000001,Vente,600000,,,RUE DU MORBIHAN,0021,56400,56167,Plougoumelen,56,,,561670000C1099,,,,,,,,,,,,,0,,,,,AB,terrains a bâtir,,,447,-2.899271,47.665904
2019-824590,2019-10-30,000001,Vente,600000,8,,RUE DU MORBIHAN,0021,56400,56167,Plougoumelen,56,,,561670000C1104,,,,,,,,,,,,,0,4,Local industriel. commercial ou assimilé,1000,0,S,sols,,,2590,-2.899482,47.665338
2019-824590,2019-10-30,000001,Vente,600000,,,RUE DU MORBIHAN,0021,56400,56167,Plougoumelen,56,,,561670000C1105,,,,,,,,,,,,,0,,,,,S,sols,,,263,-2.899574,47.665705
2019-824597,2019-10-31,000002,Vente,88500,,,LESTREVIAU,B441,56400,56167,Plougoumelen,56,,,561670000F0770,,,,,,,,,,,,,0,,,,,P,prés,,,29,-2.907065,47.642876
2019-824597,2019-10-31,000002,Vente,88500,,,RAQUERIEU,B838,56400,56167,Plougoumelen,56,,,561670000F0778,,,,,,,,,,,,,0,,,,,L,landes,,,244,-2.906521,47.643379
2019-824597,2019-10-31,000002,Vente,88500,,,LESTREVIAU,B441,56400,56167,Plougoumelen,56,,,561670000F0873,,,,,,,,,,,,,0,,,,,P,prés,,,1459,-2.906613,47.643128
2019-824597,2019-10-31,000002,Vente,88500,,,LESTREVIAU,B441,56400,56167,Plougoumelen,56,,,561670000F1163,,,,,,,,,,,,,0,,,,,S,sols,,,226,-2.906974,47.642839
2019-824602,2019-11-06,000001,Vente,1157,,,RTE DU TRAON,0171,56400,56167,Plougoumelen,56,,,56167000AB0010,,,,,,,,,,,,,0,,,,,T,terres,,,89,-2.920922,47.65319
2019-824604,2019-10-31,000001,Vente,88500,,,RAQUERIEU,B838,56400,56167,Plougoumelen,56,,,561670000F0778,,,,,,,,,,,,,0,,,,,L,landes,,,244,-2.906521,47.643379
2019-824604,2019-10-31,000001,Vente,88500,,,LESTREVIAU,B441,56400,56167,Plougoumelen,56,,,561670000F0873,,,,,,,,,,,,,0,,,,,P,prés,,,1459,-2.906613,47.643128
2019-824604,2019-10-31,000001,Vente,88500,,,LESTREVIAU,B441,56400,56167,Plougoumelen,56,,,561670000F1164,,,,,,,,,,,,,0,,,,,S,sols,,,192,-2.906796,47.642887
2019-824618,2019-10-30,000001,Vente,257700,9,,RUE LEONARD EUNSON,0004,56400,56167,Plougoumelen,56,,,56167000AB0366,,,,,,,,,,,,,0,1,Maison,100,3,S,sols,,,366,-2.914939,47.651618
2019-824656,2019-11-08,000002,Vente,67000,,,ER ROUGOUET,B224,56400,56167,Plougoumelen,56,,,561670000F1159,,,,,,,,,,,,,0,,,,,S,sols,,,648,-2.92585,47.639933
2019-824664,2019-11-06,000001,Vente,150000,,,LESTREVIAU,B441,56400,56167,Plougoumelen,56,,,561670000F0154,,,,,,,,,,,,,0,,,,,S,sols,,,1180,,
2019-824664,2019-11-06,000001,Vente,150000,,,LESTREVIAU,B441,56400,56167,Plougoumelen,56,,,561670000F0863,,,,,,,,,,,,,0,,,,,T,terres,,,246,-2.909378,47.64257
2019-824664,2019-11-06,000001,Vente,150000,,,LESTREVIAU,B441,56400,56167,Plougoumelen,56,,,561670000F0867,,,,,,,,,,,,,0,,,,,S,sols,,,34,,
2019-824664,2019-11-06,000001,Vente,150000,,,LESTREVIAU,B441,56400,56167,Plougoumelen,56,,,561670000F0868,,,,,,,,,,,,,0,,,,,S,sols,,,323,,
2019-824664,2019-11-06,000001,Vente,150000,,,LESTREVIAU,B441,56400,56167,Plougoumelen,56,,,561670000F0869,,,,,,,,,,,,,0,,,,,S,sols,,,26,-2.909139,47.642457
2019-824704,2019-11-12,000001,Vente,612525,16,,IMP DE BOCHOCHO,0017,56400,56167,Plougoumelen,56,,,561670000E2179,,,,,,,,,,,,,0,1,Maison,164,4,S,sols,,,500,-2.916946,47.663327
2019-824704,2019-11-12,000001,Vente,612525,16,,IMP DE BOCHOCHO,0017,56400,56167,Plougoumelen,56,,,561670000E2179,,,,,,,,,,,,,0,1,Maison,164,4,AG,terrains d'agrément,,,1054,-2.916946,47.663327
2019-824712,2019-11-20,000001,Vente,367000,9,,RUE DU GOLFE,0022,56400,56167,Plougoumelen,56,,,561670000D1577,,,,,,,,,,,,,0,,,,,S,sols,,,115,-2.903171,47.664795
2019-824712,2019-11-20,000001,Vente,367000,9,,RUE DU GOLFE,0022,56400,56167,Plougoumelen,56,,,561670000D1640,,,,,,,,,,,,,0,4,Local industriel. commercial ou assimilé,595,0,S,sols,,,2331,-2.90311,47.664549
2019-824877,2019-11-18,000001,Vente,397000,22,,RUE DE ROH MANE,0149,56400,56167,Plougoumelen,56,,,56167000AC0350,,,,,,,,,,,,,0,1,Maison,132,5,S,sols,,,848,-2.918295,47.649947
2019-825108,2019-12-07,000001,Vente,155080,12,,RUE YVES DE PONT SAL,0192,56400,56167,Plougoumelen,56,,,56167000AB0122,,,7,,,,,,,,,,1,3,Dépendance,,0,,,,,,-2.916247,47.653993
2019-825108,2019-12-07,000001,Vente,155080,12,,RUE YVES DE PONT SAL,0192,56400,56167,Plougoumelen,56,,,56167000AB0122,,,2,39.14,,,,,,,,,1,1,Maison,44,3,,,,,,-2.916247,47.653993
2019-825315,2019-12-30,000001,Vente,115000,,,RUE JOSEPH LE BRIX,0098,56400,56167,Plougoumelen,56,,,56167000AC0462,,,,,,,,,,,,,0,,,,,S,sols,,,168,-2.916139,47.650927
2019-825315,2019-12-30,000001,Vente,115000,,,RUE JOSEPH LE BRIX,0098,56400,56167,Plougoumelen,56,,,56167000AC0464,,,,,,,,,,,,,0,,,,,AB,terrains a bâtir,,,564,-2.916043,47.650701
