id_mutation,date_mutation,numero_disposition,nature_mutation,valeur_fonciere,adresse_numero,adresse_suffixe,adresse_nom_voie,adresse_code_voie,code_postal,code_commune,nom_commune,code_departement,ancien_code_commune,ancien_nom_commune,id_parcelle,ancien_id_parcelle,numero_volume,lot1_numero,lot1_surface_carrez,lot2_numero,lot2_surface_carrez,lot3_numero,lot3_surface_carrez,lot4_numero,lot4_surface_carrez,lot5_numero,lot5_surface_carrez,nombre_lots,code_type_local,type_local,surface_reelle_bati,nombre_pieces_principales,code_nature_culture,nature_culture,code_nature_culture_speciale,nature_culture_speciale,surface_terrain,longitude,latitude
2019-834083,2019-01-25,000001,Vente,2500,,,LE BOURG,B011,58420,58191,Neuilly,58,,,581910000B0377,,,,,,,,,,,,,0,,,,,P,prés,,,1250,3.505305,47.238909
2019-834343,2019-05-21,000001,Vente,2000,,,LES PRES PERRIERS,B140,58420,58191,Neuilly,58,,,58191000ZD0038,,,,,,,,,,,,,0,,,,,P,prés,,,11260,3.511832,47.230166
2019-834380,2019-06-04,000001,Vente,75000,2,,IMP DES CHAMPS BOURDON,0020,58420,58191,Neuilly,58,,,581910000B0403,,,,,,,,,,,,,0,1,Maison,137,5,S,sols,,,619,3.503809,47.239011
2019-834380,2019-06-04,000001,Vente,75000,,,LE BOURG,B011,58420,58191,Neuilly,58,,,581910000B0404,,,,,,,,,,,,,0,,,,,P,prés,,,310,3.503698,47.238821
2019-834380,2019-06-04,000001,Vente,75000,,,LE BOURG,B011,58420,58191,Neuilly,58,,,581910000B0412,,,,,,,,,,,,,0,,,,,S,sols,,,270,3.503613,47.23912
2019-834380,2019-06-04,000001,Vente,75000,,,LE BOURG,B011,58420,58191,Neuilly,58,,,581910000B0413,,,,,,,,,,,,,0,,,,,VE,vergers,,,322,3.503418,47.239133
2019-834679,2019-09-10,000001,Vente,96000,9,,CHE DES RIOTS,0075,58420,58191,Neuilly,58,,,581910000A0174,,,,,,,,,,,,,0,1,Maison,66,3,S,sols,,,1040,3.492737,47.264859
2019-834679,2019-09-10,000001,Vente,96000,,,OLCY,B099,58420,58191,Neuilly,58,,,581910000A0175,,,,,,,,,,,,,0,,,,,VE,vergers,,,1180,3.492667,47.26502
2019-834679,2019-09-10,000001,Vente,96000,,,VIGNES SUR LES MAISONS,B165,58420,58191,Neuilly,58,,,581910000A0306,,,,,,,,,,,,,0,,,,,L,landes,,,895,3.492048,47.264703
2019-834679,2019-09-10,000001,Vente,96000,,,VIGNES SUR LES MAISONS,B165,58420,58191,Neuilly,58,,,581910000A0307,,,,,,,,,,,,,0,,,,,L,landes,,,5020,3.491269,47.264883
2019-834763,2019-10-04,000001,Vente,142700,,,FLASSY,B063,58420,58191,Neuilly,58,,,581910000C0054,,,,,,,,,,,,,0,,,,,J,jardins,,,516,3.505949,47.22806
2019-834763,2019-10-04,000001,Vente,142700,,,FLASSY,B063,58420,58191,Neuilly,58,,,581910000C0056,,,,,,,,,,,,,0,,,,,S,sols,,,670,3.50546,47.228243
2019-834763,2019-10-04,000001,Vente,142700,,,FLASSY,B063,58420,58191,Neuilly,58,,,581910000C0059,,,,,,,,,,,,,0,,,,,S,sols,,,35,3.505535,47.228017
2019-834763,2019-10-04,000001,Vente,142700,,,FLASSY,B063,58420,58191,Neuilly,58,,,581910000C0678,,,,,,,,,,,,,0,,,,,P,prés,,,775,3.50612,47.22819
2019-834763,2019-10-04,000001,Vente,142700,2,,RUE DES CHAUMES,0025,58420,58191,Neuilly,58,,,581910000C0680,,,,,,,,,,,,,0,1,Maison,64,3,S,sols,,,857,3.505529,47.228118
2019-834763,2019-10-04,000001,Vente,142700,,,FLASSY,B063,58420,58191,Neuilly,58,,,581910000C0704,,,,,,,,,,,,,0,,,,,S,sols,,,121,3.50539,47.228042
2019-834889,2019-11-29,000001,Vente,12207.5,,,LA PRAIRIE COURGEON,B110,58420,58191,Neuilly,58,,,58191000ZM0004,,,,,,,,,,,,,0,,,,,P,prés,,,6135,3.52155,47.228576
2019-834889,2019-11-29,000001,Vente,12207.5,,,LA PRAIRIE COURGEON,B110,58420,58191,Neuilly,58,,,58191000ZM0004,,,,,,,,,,,,,0,,,,,P,prés,,,6135,3.52155,47.228576
2019-834889,2019-11-29,000001,Vente,12207.5,,,LA PRAIRIE COURGEON,B110,58420,58191,Neuilly,58,,,58191000ZM0005,,,,,,,,,,,,,0,,,,,P,prés,,,18280,3.519327,47.229935
2019-834889,2019-11-29,000001,Vente,12207.5,,,LA PRAIRIE COURGEON,B110,58420,58191,Neuilly,58,,,58191000ZM0005,,,,,,,,,,,,,0,,,,,P,prés,,,18280,3.519327,47.229935
2019-834983,2019-12-17,000001,Vente,38601,,,LA COTE A BURLAND,B051,58420,58191,Neuilly,58,,,581910000A0869,,,,,,,,,,,,,0,,,,,T,terres,,,40,3.5071,47.265908
2019-834983,2019-12-17,000001,Vente,38601,,,LA COTE A BURLAND,B051,58420,58191,Neuilly,58,,,581910000A0870,,,,,,,,,,,,,0,,,,,T,terres,,,700,3.507207,47.265632
