id_mutation,date_mutation,numero_disposition,nature_mutation,valeur_fonciere,adresse_numero,adresse_suffixe,adresse_nom_voie,adresse_code_voie,code_postal,code_commune,nom_commune,code_departement,ancien_code_commune,ancien_nom_commune,id_parcelle,ancien_id_parcelle,numero_volume,lot1_numero,lot1_surface_carrez,lot2_numero,lot2_surface_carrez,lot3_numero,lot3_surface_carrez,lot4_numero,lot4_surface_carrez,lot5_numero,lot5_surface_carrez,nombre_lots,code_type_local,type_local,surface_reelle_bati,nombre_pieces_principales,code_nature_culture,nature_culture,code_nature_culture_speciale,nature_culture_speciale,surface_terrain,longitude,latitude
2019-873837,2019-01-14,000002,Vente,60000,2,,RUE TRIEUX DE LA COUR,0100,59740,59148,Clairfayts,59,,,591480000A0244,,,,,,,,,,,,,0,1,Maison,73,5,S,sols,,,552,4.119765,50.156506
2019-873837,2019-01-14,000002,Vente,60000,,,LE VILLAGE,B023,59740,59148,Clairfayts,59,,,591480000A0385,,,,,,,,,,,,,0,,,,,PA,pâtures,PATUR,Pâture plantée,217,4.119952,50.156421
2019-873837,2019-01-14,000002,Vente,60000,,,LE VILLAGE,B023,59740,59148,Clairfayts,59,,,591480000A0646,,,,,,,,,,,,,0,,,,,PA,pâtures,PATUR,Pâture plantée,252,4.119649,50.156464
2019-873890,2019-01-21,000001,Vente,10000,,,CHAPELLE SAINT LIENARD,B008,59740,59148,Clairfayts,59,,,591480000B0438,,,,,,,,,,,,,0,,,,,PA,pâtures,PATUR,Pâture plantée,1280,4.124194,50.154637
2019-874230,2019-02-21,000001,Vente,150000,8,,RUE TRIEUX DE LA COUR,0100,59740,59148,Clairfayts,59,,,591480000A0582,,,,,,,,,,,,,0,1,Maison,115,6,S,sols,,,618,4.120708,50.155985
2019-874317,2019-03-05,000001,Vente,100000,18,,RUE D EPINOY,0014,59740,59148,Clairfayts,59,,,591480000A0124,,,,,,,,,,,,,0,1,Maison,67,3,S,sols,,,605,4.111995,50.166217
2019-874317,2019-03-05,000001,Vente,100000,,,HAMEAU D EPINOY,B014,59740,59148,Clairfayts,59,,,591480000A0125,,,,,,,,,,,,,0,,,,,S,sols,,,38,4.111702,50.166302
2019-874317,2019-03-05,000001,Vente,100000,,,HAMEAU D EPINOY,B014,59740,59148,Clairfayts,59,,,591480000A0518,,,,,,,,,,,,,0,,,,,PA,pâtures,PATUR,Pâture plantée,1690,4.112238,50.166018
2019-875826,2019-07-24,000002,Vente,4000,,,RUE D ORBAYE,0040,59740,59148,Clairfayts,59,,,591480000A0648,,,,,,,,,,,,,0,,,,,PA,pâtures,PATUR,Pâture plantée,1196,4.122966,50.155343
2019-875844,2019-08-02,000001,Vente,170000,7,,RUE DE SIVRY,0089,59740,59148,Clairfayts,59,,,591480000A0464,,,,,,,,,,,,,0,1,Maison,111,5,S,sols,,,500,4.106742,50.174526
2019-875844,2019-08-02,000001,Vente,170000,7,,RUE DE SIVRY,0089,59740,59148,Clairfayts,59,,,591480000A0464,,,,,,,,,,,,,0,1,Maison,111,5,J,jardins,,,330,4.106742,50.174526
2019-875844,2019-08-02,000001,Vente,170000,,,VERS BEAURIEUX,B022,59740,59148,Clairfayts,59,,,591480000A0466,,,,,,,,,,,,,0,,,,,PA,pâtures,PATUR,Pâture plantée,173,4.107028,50.174658
