id_mutation,date_mutation,numero_disposition,nature_mutation,valeur_fonciere,adresse_numero,adresse_suffixe,adresse_nom_voie,adresse_code_voie,code_postal,code_commune,nom_commune,code_departement,ancien_code_commune,ancien_nom_commune,id_parcelle,ancien_id_parcelle,numero_volume,lot1_numero,lot1_surface_carrez,lot2_numero,lot2_surface_carrez,lot3_numero,lot3_surface_carrez,lot4_numero,lot4_surface_carrez,lot5_numero,lot5_surface_carrez,nombre_lots,code_type_local,type_local,surface_reelle_bati,nombre_pieces_principales,code_nature_culture,nature_culture,code_nature_culture_speciale,nature_culture_speciale,surface_terrain,longitude,latitude
2019-877527,2019-01-18,000001,Vente,139000,105,,RUE JEAN JAURES,0420,59161,59206,Escaudœuvres,59,,,59206000AE0137,,,,,,,,,,,,,0,1,Maison,81,4,S,sols,,,90,3.259059,50.188845
2019-877527,2019-01-18,000001,Vente,139000,,,RUE JEAN JAURES,0420,59161,59206,Escaudœuvres,59,,,59206000AE0138,,,,,,,,,,,,,0,,,,,J,jardins,POTAG,Jardin potager,365,3.258885,50.188955
2019-877625,2019-01-30,000001,Vente,82800,26,,RUE JEAN PERRIN,0430,59161,59206,Escaudœuvres,59,,,59206000AM0262,,,,,,,,,,,,,0,1,Maison,83,5,S,sols,,,286,3.27135,50.19052
2019-877637,2019-01-16,000002,Vente,500,,,RUE JEAN JAURES,0420,59161,59206,Escaudœuvres,59,,,59206000AC0709,,,,,,,,,,,,,0,,,,,S,sols,,,6,3.263496,50.192303
2019-877647,2019-01-30,000001,Vente,30000,52,,RUE JEAN JAURES,0420,59161,59206,Escaudœuvres,59,,,59206000AE0854,,,,,,,,,,,,,0,1,Maison,87,4,S,sols,,,53,3.256615,50.186674
2019-877647,2019-01-30,000001,Vente,30000,,,RUE JEAN JAURES,0420,59161,59206,Escaudœuvres,59,,,59206000AE0856,,,,,,,,,,,,,0,,,,,S,sols,,,12,3.25659,50.186632
2019-877671,2019-01-22,000001,Vente,75000,125,,RUE JEAN JAURES,0420,59161,59206,Escaudœuvres,59,,,59206000AC0031,,,,,,,,,,,,,0,1,Maison,70,2,S,sols,,,124,3.260237,50.189824
2019-877850,2019-02-27,000001,Vente,69085,18,,RUE DU MARAIS,0460,59161,59206,Escaudœuvres,59,,,59206000AE0014,,,,,,,,,,,,,0,1,Maison,79,3,S,sols,,,196,3.251394,50.185999
2019-877922,2019-02-20,000001,Vente,56000,269,,RUE JEAN JAURES,0420,59161,59206,Escaudœuvres,59,,,59206000AB0106,,,,,,,,,,,,,0,1,Maison,110,5,S,sols,,,175,3.269893,50.196154
2019-878080,2019-03-26,000001,Vente,35500,7,,RUE D ERRE,0240,59161,59206,Escaudœuvres,59,,,59206000AC0408,,,,,,,,,,,,,0,1,Maison,66,2,S,sols,,,154,3.26204,50.191468
2019-878088,2019-03-19,000001,Vente,116300,,,RUE JEAN JAURES,0420,59161,59206,Escaudœuvres,59,,,59206000AC0287,,,,,,,,,,,,,0,,,,,J,jardins,POTAG,Jardin potager,460,3.263593,50.190978
2019-878088,2019-03-19,000001,Vente,116300,226,,RUE JEAN JAURES,0420,59161,59206,Escaudœuvres,59,,,59206000AC0299,,,,,,,,,,,,,0,1,Maison,128,6,S,sols,,,514,3.263163,50.191204
2019-878135,2019-03-12,000001,Vente,124000,116,,RUE JEAN JAURES,0420,59161,59206,Escaudœuvres,59,,,59206000AE0288,,,,,,,,,,,,,0,1,Maison,90,4,S,sols,,,134,3.258455,50.187927
2019-878135,2019-03-12,000001,Vente,124000,,,RUE JEAN JAURES,0420,59161,59206,Escaudœuvres,59,,,59206000AE0289,,,,,,,,,,,,,0,,,,,J,jardins,POTAG,Jardin potager,583,3.258717,50.187736
2019-878158,2019-03-15,000001,Vente,131000,23,,RUE PAUL LANGEVIN,0560,59161,59206,Escaudœuvres,59,,,59206000AM0040,,,,,,,,,,,,,0,1,Maison,83,5,S,sols,,,301,3.269403,50.191028
2019-878253,2019-04-15,000001,Vente,110000,80,,RUE DE L EPINETTE,0180,59161,59206,Escaudœuvres,59,,,59206000AM0419,,,,,,,,,,,,,0,1,Maison,91,6,S,sols,,,392,3.268829,50.189808
2019-878262,2019-04-15,000001,Vente,210000,46,,RUE DU ONZE NOVEMBRE,0520,59161,59206,Escaudœuvres,59,,,59206000AM0359,,,,,,,,,,,,,0,1,Maison,100,4,J,jardins,POTAG,Jardin potager,1273,3.273033,50.192389
2019-878262,2019-04-15,000001,Vente,210000,46,,RUE DU ONZE NOVEMBRE,0520,59161,59206,Escaudœuvres,59,,,59206000AM0359,,,,,,,,,,,,,0,1,Maison,100,4,S,sols,,,997,3.273033,50.192389
2019-878268,2019-04-18,000001,Vente,55000,64,,RUE DE L EPINETTE,0180,59161,59206,Escaudœuvres,59,,,59206000AM0411,,,,,,,,,,,,,0,1,Maison,67,4,S,sols,,,407,3.267988,50.189522
2019-878269,2019-04-17,000003,Vente,300000,,,LES PRES D EN BAS,B011,59161,59206,Escaudœuvres,59,,,59206000AK0229,,,,,,,,,,,,,0,,,,,S,sols,,,491,3.263529,50.195541
2019-878269,2019-04-17,000003,Vente,300000,,,RUE D EN BAS,0040,59161,59206,Escaudœuvres,59,,,59206000AK0231,,,,,,,,,,,,,0,,,,,S,sols,,,210,3.263903,50.195345
2019-878273,2019-04-03,000001,Vente,47400,119,,RUE JEAN JAURES,0420,59161,59206,Escaudœuvres,59,,,59206000AC0466,,,,,,,,,,,,,0,1,Maison,94,3,S,sols,,,304,3.260051,50.189671
2019-878306,2019-04-24,000001,Vente,110000,48,,RUE PAUL LANGEVIN,0560,59161,59206,Escaudœuvres,59,,,59206000AM0292,,,,,,,,,,,,,0,1,Maison,105,6,S,sols,,,258,3.270851,50.19012
2019-878468,2019-05-21,000002,Vente,1940,,,RUE JEAN JAURES,0420,59161,59206,Escaudœuvres,59,,,59206000AC0706,,,,,,,,,,,,,0,,,,,J,jardins,POTAG,Jardin potager,194,3.265128,50.191738
2019-878650,2019-05-22,000001,Vente,60000,68,,RUE D ERRE,0240,59161,59206,Escaudœuvres,59,,,59206000AK0144,,,,,,,,,,,,,0,1,Maison,96,4,S,sols,,,250,3.258884,50.192899
2019-878650,2019-05-22,000001,Vente,60000,,,RUE D ERRE,0240,59161,59206,Escaudœuvres,59,,,59206000AK0145,,,,,,,,,,,,,0,,,,,J,jardins,POTAG,Jardin potager,625,3.259222,50.193113
2019-878677,2019-05-29,000001,Vente,43000,38,,RUE D ERRE,0240,59161,59206,Escaudœuvres,59,,,59206000AC0182,,,,,,,,,,,,,0,2,Appartement,19,2,S,sols,,,127,3.261764,50.191863
2019-878677,2019-05-29,000001,Vente,43000,38,,RUE D ERRE,0240,59161,59206,Escaudœuvres,59,,,59206000AC0182,,,,,,,,,,,,,0,2,Appartement,75,3,S,sols,,,127,3.261764,50.191863
2019-878837,2019-06-26,000001,Vente,60000,4,,RUE DU MARAIS,0460,59161,59206,Escaudœuvres,59,,,59206000AE0005,,,,,,,,,,,,,0,1,Maison,75,3,S,sols,,,180,3.250871,50.186095
2019-878837,2019-06-26,000001,Vente,60000,,,RUE DU MARAIS,0460,59161,59206,Escaudœuvres,59,,,59206000AE0006,,,,,,,,,,,,,0,,,,,S,sols,,,200,3.250954,50.186029
2019-878882,2019-06-26,000001,Vente,12000,,,LE CHATEAU,B004,59161,59206,Escaudœuvres,59,,,59206000AL0006,,,,,,,,,,,,,0,,,,,J,jardins,POTAG,Jardin potager,1776,3.263154,50.199132
2019-878882,2019-06-26,000001,Vente,12000,,,LE CHATEAU,B004,59161,59206,Escaudœuvres,59,,,59206000AL0007,,,,,,,,,,,,,0,,,,,PA,pâtures,,,2458,3.263684,50.198789
2019-878924,2019-07-09,000001,Vente,124000,4,,RUE DU PREMIER MAI,0580,59161,59206,Escaudœuvres,59,,,59206000AE0544,,,,,,,,,,,,,0,1,Maison,73,5,S,sols,,,175,3.256454,50.187462
2019-879007,2019-07-10,000001,Vente,110000,49,,RUE DE L EPINETTE,0180,59161,59206,Escaudœuvres,59,,,59206000AM0049,,,,,,,,,,,,,0,1,Maison,83,5,S,sols,,,252,3.26957,50.189838
2019-879011,2019-07-12,000001,Vente,10000,26,,RUE DU MARAIS,0460,59161,59206,Escaudœuvres,59,,,59206000AE0018,,,,,,,,,,,,,0,1,Maison,34,1,S,sols,,,109,3.251098,50.186169
2019-879070,2019-07-17,000001,Vente,1,9012,,RUE JEAN JAURES,0420,59161,59206,Escaudœuvres,59,,,59206000AB0438,,,,,,,,,,,,,0,,,,,S,sols,,,8,3.270864,50.196657
2019-879164,2019-07-19,000001,Vente,70000,64,,RUE DU MARAIS,0460,59161,59206,Escaudœuvres,59,,,59206000AE0039,,,,,,,,,,,,,0,1,Maison,91,4,S,sols,,,154,3.252322,50.186071
2019-879164,2019-07-19,000001,Vente,70000,,,RUE DU MARAIS,0460,59161,59206,Escaudœuvres,59,,,59206000AE0500,,,,,,,,,,,,,0,,,,,S,sols,,,392,3.252054,50.186159
2019-879164,2019-07-19,000001,Vente,70000,,,RUE DU MARAIS,0460,59161,59206,Escaudœuvres,59,,,59206000AE0613,,,,,,,,,,,,,0,,,,,S,sols,,,308,3.251746,50.18551
2019-879168,2019-07-23,000001,Vente,140000,,,RUE D EN BAS,0040,59161,59206,Escaudœuvres,59,,,59206000AK0192,,,,,,,,,,,,,0,,,,,S,sols,,,29,3.260771,50.192334
2019-879168,2019-07-23,000001,Vente,140000,1,B,RUE D EN BAS,0040,59161,59206,Escaudœuvres,59,,,59206000AK0193,,,,,,,,,,,,,0,4,Local industriel. commercial ou assimilé,,0,J,jardins,POTAG,Jardin potager,777,3.260668,50.192419
2019-879168,2019-07-23,000001,Vente,140000,1,B,RUE D EN BAS,0040,59161,59206,Escaudœuvres,59,,,59206000AK0193,,,,,,,,,,,,,0,4,Local industriel. commercial ou assimilé,313,0,J,jardins,POTAG,Jardin potager,777,3.260668,50.192419
2019-879247,2019-07-22,000001,Vente,138000,18,,RUE PAUL LANGEVIN,0560,59161,59206,Escaudœuvres,59,,,59206000AM0016,,,,,,,,,,,,,0,1,Maison,103,6,S,sols,,,265,3.268313,50.19132
2019-879258,2019-08-02,000001,Vente,220000,6,,RUE PABLO PICASSO,0530,59161,59206,Escaudœuvres,59,,,59206000ZK0143,,,,,,,,,,,,,0,1,Maison,144,6,S,sols,,,143,3.275859,50.183043
2019-879258,2019-08-02,000001,Vente,220000,6,,RUE PABLO PICASSO,0530,59161,59206,Escaudœuvres,59,,,59206000ZK0143,,,,,,,,,,,,,0,1,Maison,144,6,AG,terrains d'agrément,,,1064,3.275859,50.183043
2019-879263,2019-07-22,000002,Vente,120000,236,,RUE JEAN JAURES,0420,59161,59206,Escaudœuvres,59,,,59206000AC0292,,,,,,,,,,,,,0,4,Local industriel. commercial ou assimilé,100,0,S,sols,,,773,3.263749,50.19173
2019-879263,2019-07-22,000002,Vente,120000,236,,RUE JEAN JAURES,0420,59161,59206,Escaudœuvres,59,,,59206000AC0292,,,,,,,,,,,,,0,1,Maison,148,6,S,sols,,,773,3.263749,50.19173
2019-879263,2019-07-22,000002,Vente,120000,,,RUE JEAN JAURES,0420,59161,59206,Escaudœuvres,59,,,59206000AC0723,,,,,,,,,,,,,0,,,,,J,jardins,POTAG,Jardin potager,205,3.263784,50.191516
2019-879263,2019-07-22,000002,Vente,120000,,,RUE JEAN JAURES,0420,59161,59206,Escaudœuvres,59,,,59206000AC0725,,,,,,,,,,,,,0,,,,,J,jardins,POTAG,Jardin potager,140,3.264046,50.191518
2019-879324,2019-07-23,000001,Vente,28466.66,10,,RUE DU ONZE NOVEMBRE,0520,59161,59206,Escaudœuvres,59,,,59206000AB0382,,,,,,,,,,,,,0,1,Maison,150,7,S,sols,,,127,3.270522,50.193943
2019-879324,2019-07-23,000001,Vente,28466.66,,,RUE DU ONZE NOVEMBRE,0520,59161,59206,Escaudœuvres,59,,,59206000AB0383,,,,,,,,,,,,,0,,,,,J,jardins,POTAG,Jardin potager,619,3.270145,50.193754
2019-879324,2019-07-23,000001,Vente,28466.66,,,RUE DU ONZE NOVEMBRE,0520,59161,59206,Escaudœuvres,59,,,59206000AB0383,,,,,,,,,,,,,0,,,,,S,sols,,,124,3.270145,50.193754
2019-879324,2019-07-23,000001,Vente,28466.66,,,RUE DU ONZE NOVEMBRE,0520,59161,59206,Escaudœuvres,59,,,59206000AB0384,,,,,,,,,,,,,0,,,,,S,sols,,,121,3.270274,50.193704
2019-879324,2019-07-23,000001,Vente,28466.66,,,RUE DU ONZE NOVEMBRE,0520,59161,59206,Escaudœuvres,59,,,59206000AB0384,,,,,,,,,,,,,0,,,,,J,jardins,MARAI,Pré marais,620,3.270274,50.193704
2019-879324,2019-07-23,000001,Vente,28466.66,,,RUE DU ONZE NOVEMBRE,0520,59161,59206,Escaudœuvres,59,,,59206000AB0385,,,,,,,,,,,,,0,,,,,S,sols,,,133,3.270548,50.193895
2019-879389,2019-08-06,000001,Vente,141000,5,,RUE PAUL LANGEVIN,0560,59161,59206,Escaudœuvres,59,,,59206000AM0027,,,,,,,,,,,,,0,1,Maison,83,5,S,sols,,,450,3.268185,50.191951
2019-879396,2019-08-02,000001,Vente,180000,180,,RUE DU MARAIS,0460,59161,59206,Escaudœuvres,59,,,59206000AE0504,,,,,,,,,,,,,0,1,Maison,152,7,J,jardins,POTAG,Jardin potager,1221,3.257981,50.18908
2019-879396,2019-08-02,000001,Vente,180000,180,,RUE DU MARAIS,0460,59161,59206,Escaudœuvres,59,,,59206000AE0504,,,,,,,,,,,,,0,1,Maison,152,7,S,sols,,,158,3.257981,50.18908
2019-879416,2019-08-06,000001,Vente,111100,76,,RUE D ERRE,0240,59161,59206,Escaudœuvres,59,,,59206000AK0136,,,,,,,,,,,,,0,1,Maison,95,4,S,sols,,,261,3.258373,50.19323
2019-879416,2019-08-06,000001,Vente,111100,,,RUE D ERRE,0240,59161,59206,Escaudœuvres,59,,,59206000AK0137,,,,,,,,,,,,,0,,,,,J,jardins,POTAG,Jardin potager,635,3.258794,50.193449
2019-879421,2019-08-09,000001,Vente,55000,14,,RUE GABRIEL PERI,0380,59161,59206,Escaudœuvres,59,,,59206000AM0103,,,,,,,,,,,,,0,1,Maison,103,6,S,sols,,,398,3.269988,50.192384
2019-879445,2019-09-02,000001,Vente,130000,55,,RUE DE L EPINETTE,0180,59161,59206,Escaudœuvres,59,,,59206000AM0052,,,,,,,,,,,,,0,1,Maison,103,6,S,sols,,,252,3.269884,50.189683
2019-879529,2019-06-21,000001,Adjudication,40200,,,RUE JEAN JAURES,0420,59161,59206,Escaudœuvres,59,,,59206000AC0373,,,,,,,,,,,,,0,,,,,S,sols,,,18,3.264531,50.192774
2019-879529,2019-06-21,000001,Adjudication,40200,177,,RUE JEAN JAURES,0420,59161,59206,Escaudœuvres,59,,,59206000AC0667,,,,,,,,,,,,,0,1,Maison,154,6,S,sols,,,189,3.264399,50.19279
2019-879544,2019-09-10,000001,Vente,103000,14,,RLE D ERRE,0200,59161,59206,Escaudœuvres,59,,,59206000AC0427,,,,,,,,,,,,,0,1,Maison,90,4,S,sols,,,241,3.263038,50.193085
2019-879637,2019-08-28,000002,Vente,58000,198,,RUE JEAN JAURES,0420,59161,59206,Escaudœuvres,59,,,59206000AC0718,,,,,,,,,,,,,0,1,Maison,100,3,S,sols,,,322,3.261847,50.190334
2019-879637,2019-08-28,000002,Vente,58000,,,RUE JEAN JAURES,0420,59161,59206,Escaudœuvres,59,,,59206000AC0720,,,,,,,,,,,,,0,,,,,AG,terrains d'agrément,,,34,3.261822,50.190298
2019-879739,2019-09-16,000001,Vente,139900,196,,RUE DU MARAIS,0460,59161,59206,Escaudœuvres,59,,,59206000AC0005,,,,,,,,,,,,,0,1,Maison,122,5,S,sols,,,602,3.258782,50.189685
2019-879810,2019-10-04,000001,Vente,180000,,,RUE JEAN JAURES,0420,59161,59206,Escaudœuvres,59,,,59206000AC0154,,,,,,,,,,,,,0,,,,,J,jardins,POTAG,Jardin potager,1067,3.263733,50.192977
2019-879810,2019-10-04,000001,Vente,180000,175,,RUE JEAN JAURES,0420,59161,59206,Escaudœuvres,59,,,59206000AC0214,,,,,,,,,,,,,0,4,Local industriel. commercial ou assimilé,63,0,S,sols,,,511,3.264143,50.192729
2019-879810,2019-10-04,000001,Vente,180000,175,,RUE JEAN JAURES,0420,59161,59206,Escaudœuvres,59,,,59206000AC0214,,,,,,,,,,,,,0,1,Maison,140,4,S,sols,,,511,3.264143,50.192729
2019-879853,2019-09-26,000001,Vente,86000,22,,RUE FAIDHERBE,0340,59161,59206,Escaudœuvres,59,,,59206000AB0394,,,,,,,,,,,,,0,1,Maison,67,4,S,sols,,,213,3.268598,50.196958
2019-879888,2019-10-02,000001,Vente,24000,9003,,RUE JEAN JAURES,0420,59161,59206,Escaudœuvres,59,,,59206000AC0057,,,,,,,,,,,,,0,3,Dépendance,,0,S,sols,,,82,3.263057,50.191708
2019-879888,2019-10-02,000001,Vente,24000,9003,,RUE JEAN JAURES,0420,59161,59206,Escaudœuvres,59,,,59206000AC0057,,,,,,,,,,,,,0,3,Dépendance,,0,S,sols,,,82,3.263057,50.191708
2019-879888,2019-10-02,000001,Vente,24000,9003,,RUE JEAN JAURES,0420,59161,59206,Escaudœuvres,59,,,59206000AC0057,,,,,,,,,,,,,0,4,Local industriel. commercial ou assimilé,,0,S,sols,,,82,3.263057,50.191708
2019-879888,2019-10-02,000001,Vente,24000,9003,,RUE JEAN JAURES,0420,59161,59206,Escaudœuvres,59,,,59206000AC0057,,,,,,,,,,,,,0,3,Dépendance,,0,S,sols,,,82,3.263057,50.191708
2019-879888,2019-10-02,000001,Vente,24000,9003,,RUE JEAN JAURES,0420,59161,59206,Escaudœuvres,59,,,59206000AC0057,,,,,,,,,,,,,0,3,Dépendance,,0,S,sols,,,82,3.263057,50.191708
2019-879888,2019-10-02,000001,Vente,24000,9003,,RUE JEAN JAURES,0420,59161,59206,Escaudœuvres,59,,,59206000AC0057,,,,,,,,,,,,,0,4,Local industriel. commercial ou assimilé,47,0,S,sols,,,82,3.263057,50.191708
2019-879933,2019-10-28,000001,Vente,74000,16,,RUE EMILE ZOLA,0160,59161,59206,Escaudœuvres,59,,,59206000AE0050,,,,,,,,,,,,,0,1,Maison,74,3,S,sols,,,100,3.252539,50.186781
2019-879933,2019-10-28,000001,Vente,74000,,,RUE DU MARAIS,0460,59161,59206,Escaudœuvres,59,,,59206000AE0075,,,,,,,,,,,,,0,,,,,S,sols,,,61,3.252712,50.18682
2019-879946,2019-10-08,000002,Vente,210000,307,,RUE JEAN JAURES,0420,59161,59206,Escaudœuvres,59,,,59206000ZA0397,,,,,,,,,,,,,0,4,Local industriel. commercial ou assimilé,1524,0,S,sols,,,1435,3.276541,50.200757
2019-879946,2019-10-08,000002,Vente,210000,307,,RUE JEAN JAURES,0420,59161,59206,Escaudœuvres,59,,,59206000ZA0397,,,,,,,,,,,,,0,4,Local industriel. commercial ou assimilé,1780,0,S,sols,,,1435,3.276541,50.200757
2019-879946,2019-10-08,000002,Vente,210000,307,,RUE JEAN JAURES,0420,59161,59206,Escaudœuvres,59,,,59206000ZA0397,,,,,,,,,,,,,0,4,Local industriel. commercial ou assimilé,1276,0,S,sols,,,1435,3.276541,50.200757
2019-879946,2019-10-08,000002,Vente,210000,307,,RUE JEAN JAURES,0420,59161,59206,Escaudœuvres,59,,,59206000ZA0397,,,,,,,,,,,,,0,4,Local industriel. commercial ou assimilé,,0,S,sols,,,1435,3.276541,50.200757
2019-880016,2019-10-17,000001,Vente,147368,217,,RUE JEAN JAURES,0420,59161,59206,Escaudœuvres,59,,,59206000AB0028,,,,,,,,,,,,,0,1,Maison,92,4,S,sols,,,205,3.266018,50.194258
2019-880028,2019-11-05,000001,Vente,255000,1,,RUE PASTEUR,0550,59161,59206,Escaudœuvres,59,,,59206000ZK0123,,,,,,,,,,,,,0,1,Maison,172,6,S,sols,,,122,3.276327,50.182119
2019-880028,2019-11-05,000001,Vente,255000,1,,RUE PASTEUR,0550,59161,59206,Escaudœuvres,59,,,59206000ZK0123,,,,,,,,,,,,,0,1,Maison,172,6,AG,terrains d'agrément,,,2824,3.276327,50.182119
2019-880105,2019-11-07,000001,Vente,108000,25,,RUE FAIDHERBE,0340,59161,59206,Escaudœuvres,59,,,59206000AB0149,,,,,,,,,,,,,0,1,Maison,56,2,S,sols,,,209,3.267841,50.196783
2019-880105,2019-11-07,000001,Vente,108000,,,RUE FAIDHERBE,0340,59161,59206,Escaudœuvres,59,,,59206000AB0150,,,,,,,,,,,,,0,,,,,S,sols,,,20,3.267672,50.196686
2019-880105,2019-11-07,000001,Vente,108000,,,RUE FAIDHERBE,0340,59161,59206,Escaudœuvres,59,,,59206000AB0151,,,,,,,,,,,,,0,,,,,S,sols,,,85,3.267701,50.196658
2019-880128,2019-10-29,000001,Vente,170000,47,,RUE JEAN JAURES,0420,59161,59206,Escaudœuvres,59,,,59206000AE0180,,,,,,,,,,,,,0,1,Maison,180,8,S,sols,,,455,3.256567,50.18719
2019-880242,2019-11-13,000001,Vente,68000,9001,,RUE EMILE ZOLA,0160,59161,59206,Escaudœuvres,59,,,59206000AE0051,,,,,,,,,,,,,0,3,Dépendance,,0,S,sols,,,80,3.252606,50.186709
2019-880242,2019-11-13,000001,Vente,68000,14,,RUE EMILE ZOLA,0160,59161,59206,Escaudœuvres,59,,,59206000AE0074,,,,,,,,,,,,,0,1,Maison,61,5,S,sols,,,52,3.252757,50.186754
2019-880243,2019-11-13,000001,Vente,165700,29,,RUE DU ONZE NOVEMBRE,0520,59161,59206,Escaudœuvres,59,,,59206000AM0380,,,,,,,,,,,,,0,1,Maison,135,7,S,sols,,,508,3.27296,50.193225
2019-880284,2019-11-14,000001,Vente,111000,31,,RUE DE L EPINETTE,0180,59161,59206,Escaudœuvres,59,,,59206000AB0600,,,,,,,,,,,,,0,1,Maison,91,5,S,sols,,,543,3.267701,50.191448
2019-880284,2019-11-14,000001,Vente,111000,31,,RUE DE L EPINETTE,0180,59161,59206,Escaudœuvres,59,,,59206000AB0600,,,,,,,,,,,,,0,1,Maison,91,5,J,jardins,POTAG,Jardin potager,383,3.267701,50.191448
2019-880291,2019-12-06,000001,Vente,108000,11,,RUE PIERRE SEMART,0570,59161,59206,Escaudœuvres,59,,,59206000AM0216,,,,,,,,,,,,,0,1,Maison,83,5,S,sols,,,294,3.272338,50.190953
2019-880308,2019-12-07,000001,Vente,300000,,,RUE JEAN JAURES,0420,59161,59206,Escaudœuvres,59,,,59206000AC0250,,,,,,,,,,,,,0,,,,,J,jardins,POTAG,Jardin potager,1414,3.265249,50.192021
2019-880308,2019-12-07,000001,Vente,300000,260,,RUE JEAN JAURES,0420,59161,59206,Escaudœuvres,59,,,59206000AC0251,,,,,,,,,,,,,0,1,Maison,189,6,S,sols,,,684,3.264739,50.192421
2019-880319,2019-12-03,000001,Vente,135000,21,,RUE DU CLOS SAINT PIERRE,0146,59161,59206,Escaudœuvres,59,,,59206000AM0635,,,,,,,,,,,,,0,1,Maison,59,3,S,sols,,,503,3.266203,50.187477
2019-880357,2019-12-06,000002,Vente,144000,23,C,RUE DU MARAIS,0460,59161,59206,Escaudœuvres,59,,,59206000AH0118,,,,,,,,,,,,,0,,,,,S,sols,,,68,3.25299,50.187177
2019-880357,2019-12-06,000002,Vente,144000,,,RUE DU MARAIS,0460,59161,59206,Escaudœuvres,59,,,59206000AH0123,,,,,,,,,,,,,0,,,,,S,sols,,,11,3.252952,50.187234
2019-880380,2019-12-16,000001,Vente,235000,37,,RUE DE L EPINETTE,0180,59161,59206,Escaudœuvres,59,,,59206000AM0337,,,,,,,,,,,,,0,1,Maison,102,4,S,sols,,,136,3.268352,50.190982
2019-880380,2019-12-16,000001,Vente,235000,37,,RUE DE L EPINETTE,0180,59161,59206,Escaudœuvres,59,,,59206000AM0337,,,,,,,,,,,,,0,1,Maison,102,4,J,jardins,POTAG,Jardin potager,1295,3.268352,50.190982
2019-880399,2019-12-06,000001,Vente,204000,18,A,RLE D ERRE,0200,59161,59206,Escaudœuvres,59,,,59206000AC0604,,,,,,,,,,,,,0,1,Maison,110,6,S,sols,,,735,3.263285,50.193261
2019-880451,2019-12-09,000001,Vente,145000,4,E,RUE D EN BAS,0040,59161,59206,Escaudœuvres,59,,,59206000AC0626,,,,,,,,,,,,,0,1,Maison,108,3,S,sols,,,208,3.261489,50.192689
2019-880516,2019-12-27,000001,Vente,52000,45,,RUE JEAN JAURES,0420,59161,59206,Escaudœuvres,59,,,59206000AE0521,,,,,,,,,,,,,0,1,Maison,65,4,S,sols,,,366,3.25644,50.187149
2019-880550,2019-12-20,000001,Vente,95000,23,A,RUE DU MARAIS,0460,59161,59206,Escaudœuvres,59,,,59206000AH0116,,,,,,,,,,,,,0,1,Maison,70,5,S,sols,,,123,3.252858,50.187116
2019-880550,2019-12-20,000001,Vente,95000,23,A,RUE DU MARAIS,0460,59161,59206,Escaudœuvres,59,,,59206000AH0116,,,,,,,,,,,,,0,1,Maison,70,5,S,sols,,,123,3.252858,50.187116
2019-880550,2019-12-20,000001,Vente,95000,23,A,RUE DU MARAIS,0460,59161,59206,Escaudœuvres,59,,,59206000AH0116,,,,,,,,,,,,,0,1,Maison,70,5,S,sols,,,123,3.252858,50.187116
2019-880550,2019-12-20,000001,Vente,95000,,,RUE DU MARAIS,0460,59161,59206,Escaudœuvres,59,,,59206000AH0121,,,,,,,,,,,,,0,,,,,S,sols,,,1,3.252825,50.1872
2019-880555,2019-12-27,000001,Vente,63000,8,,RUE SALVADORE ALLENDE,0635,59161,59206,Escaudœuvres,59,,,59206000AB0451,,,,,,,,,,,,,0,1,Maison,89,2,J,jardins,MARAI,Pré marais,630,3.268265,50.19571
2019-880555,2019-12-27,000001,Vente,63000,8,,RUE SALVADORE ALLENDE,0635,59161,59206,Escaudœuvres,59,,,59206000AB0451,,,,,,,,,,,,,0,1,Maison,89,2,S,sols,,,335,3.268265,50.19571
2019-880555,2019-12-27,000001,Vente,63000,,,RUE SALVADORE ALLENDE,0635,59161,59206,Escaudœuvres,59,,,59206000AB0452,,,,,,,,,,,,,0,,,,,J,jardins,POTAG,Jardin potager,310,3.268752,50.196214
2019-880557,2019-12-19,000001,Vente,265000,14,,RUE PABLO PICASSO,0530,59161,59206,Escaudœuvres,59,,,59206000ZK0147,,,,,,,,,,,,,0,1,Maison,144,6,AG,terrains d'agrément,,,483,3.274775,50.183451
2019-880557,2019-12-19,000001,Vente,265000,14,,RUE PABLO PICASSO,0530,59161,59206,Escaudœuvres,59,,,59206000ZK0147,,,,,,,,,,,,,0,1,Maison,144,6,S,sols,,,653,3.274775,50.183451
2019-880648,2019-12-31,000001,Vente,286800,90,T,RUE DU MARAIS,0460,59161,59206,Escaudœuvres,59,,,59206000AE0747,,,,,,,,,,,,,0,1,Maison,214,6,S,sols,,,1483,3.254497,50.186727
