id_mutation,date_mutation,numero_disposition,nature_mutation,valeur_fonciere,adresse_numero,adresse_suffixe,adresse_nom_voie,adresse_code_voie,code_postal,code_commune,nom_commune,code_departement,ancien_code_commune,ancien_nom_commune,id_parcelle,ancien_id_parcelle,numero_volume,lot1_numero,lot1_surface_carrez,lot2_numero,lot2_surface_carrez,lot3_numero,lot3_surface_carrez,lot4_numero,lot4_surface_carrez,lot5_numero,lot5_surface_carrez,nombre_lots,code_type_local,type_local,surface_reelle_bati,nombre_pieces_principales,code_nature_culture,nature_culture,code_nature_culture_speciale,nature_culture_speciale,surface_terrain,longitude,latitude
2019-873944,2019-02-01,000001,Vente,432000,7,B,RUE GRANDE RUE,0020,59530,59251,Frasnoy,59,,,592510000U1148,,,,,,,,,,,,,0,1,Maison,164,6,S,sols,,,500,3.682398,50.267467
2019-873944,2019-02-01,000001,Vente,432000,7,B,RUE GRANDE RUE,0020,59530,59251,Frasnoy,59,,,592510000U1148,,,,,,,,,,,,,0,1,Maison,164,6,AG,terrains d'agrément,,,1171,3.682398,50.267467
2019-873944,2019-02-01,000001,Vente,432000,,,LE VILLAGE,B019,59530,59251,Frasnoy,59,,,592510000U1149,,,,,,,,,,,,,0,,,,,PA,pâtures,PATUR,Pâture plantée,4085,3.684066,50.268806
2019-873944,2019-02-01,000001,Vente,432000,,,LE VILLAGE,B019,59530,59251,Frasnoy,59,,,592510000U1150,,,,,,,,,,,,,0,,,,,PA,pâtures,PATUR,Pâture plantée,1006,3.683972,50.268968
2019-873944,2019-02-01,000001,Vente,432000,,,LE VILLAGE,B019,59530,59251,Frasnoy,59,,,592510000U1151,,,,,,,,,,,,,0,,,,,PA,pâtures,PATUR,Pâture plantée,3140,3.683571,50.269024
2019-873944,2019-02-01,000001,Vente,432000,,,LE VILLAGE,B019,59530,59251,Frasnoy,59,,,592510000U1152,,,,,,,,,,,,,0,,,,,PA,pâtures,PATUR,Pâture plantée,329,3.682392,50.267718
2019-873944,2019-02-01,000001,Vente,432000,,,LE VILLAGE,B019,59530,59251,Frasnoy,59,,,592510000U1154,,,,,,,,,,,,,0,,,,,PA,pâtures,PATUR,Pâture plantée,671,3.683159,50.268326
2019-873944,2019-02-01,000001,Vente,432000,,,LE VILLAGE,B019,59530,59251,Frasnoy,59,,,592510000U1155,,,,,,,,,,,,,0,,,,,PA,pâtures,PATUR,Pâture plantée,2672,3.682962,50.268454
2019-874104,2019-02-12,000001,Vente,150000,,,LE VILLAGE,B019,59530,59251,Frasnoy,59,,,592510000U0528,,,,,,,,,,,,,0,,,,,J,jardins,,,503,3.688626,50.267846
2019-874104,2019-02-12,000001,Vente,150000,,,LE VILLAGE,B019,59530,59251,Frasnoy,59,,,592510000U0530,,,,,,,,,,,,,0,,,,,PP,prés plantes,PATUR,Pâture plantée,2970,3.687655,50.26837
2019-874104,2019-02-12,000001,Vente,150000,,,LE VILLAGE,B019,59530,59251,Frasnoy,59,,,592510000U0962,,,,,,,,,,,,,0,,,,,PP,prés plantes,PATUR,Pâture plantée,2827,3.68832,50.268005
2019-874104,2019-02-12,000001,Vente,150000,18,,RTE DE GOMMEGNIES,0018,59530,59251,Frasnoy,59,,,592510000U0964,,,,,,,,,,,,,0,1,Maison,135,6,S,sols,,,914,3.688145,50.267729
2019-874580,2019-03-30,000001,Vente,140000,10,,RUE MOTTIN,0040,59530,59251,Frasnoy,59,,,592510000U0656,,,,,,,,,,,,,0,1,Maison,120,4,S,sols,,,740,3.677166,50.272217
2019-874580,2019-03-30,000001,Vente,140000,,,LE VILLAGE,B019,59530,59251,Frasnoy,59,,,592510000U0657,,,,,,,,,,,,,0,,,,,S,sols,,,221,3.677093,50.272162
2019-874580,2019-03-30,000001,Vente,140000,,,LE VILLAGE,B019,59530,59251,Frasnoy,59,,,592510000U0662,,,,,,,,,,,,,0,,,,,PA,pâtures,PATUR,Pâture plantée,5233,3.677094,50.272318
2019-874580,2019-03-30,000001,Vente,140000,,,LE VILLAGE,B019,59530,59251,Frasnoy,59,,,592510000U0662,,,,,,,,,,,,,0,,,,,S,sols,,,465,3.677094,50.272318
2019-874580,2019-03-30,000001,Vente,140000,,,LE VILLAGE,B019,59530,59251,Frasnoy,59,,,592510000U0970,,,,,,,,,,,,,0,,,,,PA,pâtures,PATUR,Pâture plantée,6303,3.676338,50.272816
2019-874580,2019-03-30,000001,Vente,140000,,,LE VILLAGE,B019,59530,59251,Frasnoy,59,,,592510000U1145,,,,,,,,,,,,,0,,,,,S,sols,,,141,3.677532,50.272213
2019-874582,2019-03-18,000001,Vente,10000,,,LES FONDS MARIVAUX,B013,59530,59251,Frasnoy,59,,,59251000ZA0022,,,,,,,,,,,,,0,,,,,BS,taillis sous futaie,,,5557,3.656177,50.276691
2019-876167,2019-08-29,000001,Vente,21000,,,AU MOULIN DE FRASNOY,B017,59530,59251,Frasnoy,59,,,59251000ZC0004,,,,,,,,,,,,,0,,,,,T,terres,,,17275,3.67065,50.265391
2019-876167,2019-08-29,000001,Vente,21000,,,AU MOULIN DE FRASNOY,B017,59530,59251,Frasnoy,59,,,59251000ZC0005,,,,,,,,,,,,,0,,,,,T,terres,,,11480,3.670148,50.266214
2019-876468,2019-10-07,000001,Vente,93600,15,,RUE GRANDE RUE,0020,59530,59251,Frasnoy,59,,,592510000U0842,,,,,,,,,,,,,0,1,Maison,134,4,S,sols,,,516,3.681467,50.268279
2019-876468,2019-10-07,000001,Vente,93600,,,LE VILLAGE,B019,59530,59251,Frasnoy,59,,,592510000U0843,,,,,,,,,,,,,0,,,,,S,sols,,,101,3.681488,50.268147
2019-876468,2019-10-07,000001,Vente,93600,,,LE VILLAGE,B019,59530,59251,Frasnoy,59,,,592510000U0853,,,,,,,,,,,,,0,,,,,J,jardins,,,550,3.681661,50.268244
2019-877415,2019-12-26,000001,Vente,211100,3,,RUE MOTTIN,0040,59530,59251,Frasnoy,59,,,592510000U0925,,,,,,,,,,,,,0,1,Maison,119,5,S,sols,,,442,3.676765,50.271541
2019-877415,2019-12-26,000001,Vente,211100,,,RUE MOTTIN,0040,59530,59251,Frasnoy,59,,,592510000U1170,,,,,,,,,,,,,0,,,,,AG,terrains d'agrément,,,140,3.676858,50.271395
