id_mutation,date_mutation,numero_disposition,nature_mutation,valeur_fonciere,adresse_numero,adresse_suffixe,adresse_nom_voie,adresse_code_voie,code_postal,code_commune,nom_commune,code_departement,ancien_code_commune,ancien_nom_commune,id_parcelle,ancien_id_parcelle,numero_volume,lot1_numero,lot1_surface_carrez,lot2_numero,lot2_surface_carrez,lot3_numero,lot3_surface_carrez,lot4_numero,lot4_surface_carrez,lot5_numero,lot5_surface_carrez,nombre_lots,code_type_local,type_local,surface_reelle_bati,nombre_pieces_principales,code_nature_culture,nature_culture,code_nature_culture_speciale,nature_culture_speciale,surface_terrain,longitude,latitude
2019-897782,2019-03-08,000003,Vente,300000,,,GUEUX,B039,60620,60091,Bouillancy,60,,,60091000ZH0015,,,,,,,,,,,,,0,,,,,P,prés,,,3540,2.921393,49.1207
2019-897782,2019-03-08,000003,Vente,300000,,,GUEUX,B039,60620,60091,Bouillancy,60,,,60091000ZH0015,,,,,,,,,,,,,0,,,,,P,prés,,,7080,2.921393,49.1207
2019-897782,2019-03-08,000003,Vente,300000,12,,RUE DE GUEUX,0036,60620,60091,Bouillancy,60,,,60091000ZH0131,,,,,,,,,,,,,0,1,Maison,250,6,S,sols,,,4855,2.920964,49.121801
2019-897782,2019-03-08,000003,Vente,300000,,,GUEUX,B039,60620,60091,Bouillancy,60,,,60091000ZH0133,,,,,,,,,,,,,0,,,,,S,sols,,,107,2.921317,49.121491
2019-897782,2019-03-08,000003,Vente,300000,,,GUEUX,B039,60620,60091,Bouillancy,60,,,60091000ZH0134,,,,,,,,,,,,,0,,,,,S,sols,,,464,2.921535,49.12147
2019-897797,2019-03-08,000001,Vente,91000,,,GUEUX,B039,60620,60091,Bouillancy,60,,,60091000ZH0135,,,,,,,,,,,,,0,,,,,S,sols,,,381,2.921771,49.121597
2019-897797,2019-03-08,000001,Vente,91000,,,GUEUX,B039,60620,60091,Bouillancy,60,,,60091000ZH0132,,,,,,,,,,,,,0,,,,,S,sols,,,2388,2.921764,49.121761
2019-899110,2019-06-27,000001,Vente,136960,5029,F,LE POIRIER MAGDELEINE,B057,60620,60091,Bouillancy,60,,,60091000ZA0029,,,,,,,,,,,,,0,,,,,T,terres,,,50976,2.894949,49.119048
2019-899110,2019-06-27,000001,Vente,136960,5029,F,LE POIRIER MAGDELEINE,B057,60620,60091,Bouillancy,60,,,60091000ZA0029,,,,,,,,,,,,,0,,,,,T,terres,,,56498,2.894949,49.119048
2019-899110,2019-06-27,000001,Vente,136960,5029,F,LE POIRIER MAGDELEINE,B057,60620,60091,Bouillancy,60,,,60091000ZA0029,,,,,,,,,,,,,0,,,,,T,terres,,,88185,2.894949,49.119048
2019-900082,2019-08-29,000001,Vente,285000,10,B,RUE DU PRESSOIR,0060,60620,60091,Bouillancy,60,,,600910000C0088,,,,,,,,,,,,,0,1,Maison,121,4,S,sols,,,805,2.929772,49.116818
2019-900391,2019-09-12,000001,Vente,215000,,,LE VILLAGE,B072,60620,60091,Bouillancy,60,,,600910000C0497,,,,,,,,,,,,,0,,,,,J,jardins,POTAG,Jardin potager,593,2.920202,49.113084
2019-900391,2019-09-12,000001,Vente,215000,25,,RUE FROMENTELLE,0031,60620,60091,Bouillancy,60,,,600910000C0498,,,,,,,,,,,,,0,1,Maison,102,3,S,sols,,,292,2.919739,49.113083
2019-900391,2019-09-12,000001,Vente,215000,,,LE VILLAGE,B072,60620,60091,Bouillancy,60,,,600910000C0532,,,,,,,,,,,,,0,,,,,J,jardins,POTAG,Jardin potager,360,2.920084,49.113041
2019-901001,2019-10-22,000002,Vente,126000,24,B,RUE DU PRESSOIR,0060,60620,60091,Bouillancy,60,,,600910000C0927,,,,,,,,,,,,,0,2,Appartement,51,2,S,sols,,,90,2.929056,49.118414
2019-901001,2019-10-22,000002,Vente,126000,24,B,RUE DU PRESSOIR,0060,60620,60091,Bouillancy,60,,,600910000C0934,,,,,,,,,,,,,0,,,,,S,sols,,,31,2.929039,49.118477
2019-901076,2019-10-31,000001,Vente,276000,16,,RUE DU PRESSOIR,0060,60620,60091,Bouillancy,60,,,600910000C0587,,,,,,,,,,,,,0,,,,,S,sols,,,294,2.929741,49.117587
2019-901076,2019-10-31,000001,Vente,276000,18,,RUE DU PRESSOIR,0060,60620,60091,Bouillancy,60,,,600910000C0691,,,,,,,,,,,,,0,1,Maison,138,6,S,sols,,,1128,2.9296,49.117884
