id_mutation,date_mutation,numero_disposition,nature_mutation,valeur_fonciere,adresse_numero,adresse_suffixe,adresse_nom_voie,adresse_code_voie,code_postal,code_commune,nom_commune,code_departement,ancien_code_commune,ancien_nom_commune,id_parcelle,ancien_id_parcelle,numero_volume,lot1_numero,lot1_surface_carrez,lot2_numero,lot2_surface_carrez,lot3_numero,lot3_surface_carrez,lot4_numero,lot4_surface_carrez,lot5_numero,lot5_surface_carrez,nombre_lots,code_type_local,type_local,surface_reelle_bati,nombre_pieces_principales,code_nature_culture,nature_culture,code_nature_culture_speciale,nature_culture_speciale,surface_terrain,longitude,latitude
2019-894188,2019-03-16,000002,Vente,50,,,RUE DES CAILLES,1170,60310,60204,Écuvilly,60,,,60204000AC0218,,,,,,,,,,,,,0,,,,,S,sols,,,18,2.919224,49.650305
2019-894188,2019-03-16,000003,Vente,50,,,RUE DES CAILLES,1170,60310,60204,Écuvilly,60,,,60204000AC0218,,,,,,,,,,,,,0,,,,,S,sols,,,18,2.919224,49.650305
2019-894533,2019-05-11,000001,Vente,125000,,,LE VAL LAMBERT,B018,60310,60204,Écuvilly,60,,,60204000AC0161,,,,,,,,,,,,,0,,,,,J,jardins,,,39,2.919083,49.65011
2019-894533,2019-05-11,000001,Vente,125000,3,,RUE DES CAILLES,1170,60310,60204,Écuvilly,60,,,60204000AC0217,,,,,,,,,,,,,0,1,Maison,105,4,S,sols,,,774,2.919277,49.650186
2019-895354,2019-08-01,000001,Vente,178000,9001,,RUE DE CATIGNY,1300,60310,60204,Écuvilly,60,,,60204000AB0045,,,,,,,,,,,,,0,1,Maison,152,6,J,jardins,,,1310,2.92385,49.646017
2019-895354,2019-08-01,000001,Vente,178000,9001,,RUE DE CATIGNY,1300,60310,60204,Écuvilly,60,,,60204000AB0045,,,,,,,,,,,,,0,1,Maison,152,6,S,sols,,,500,2.92385,49.646017
2019-895354,2019-08-01,000001,Vente,178000,,,LE VILLAGE,B019,60310,60204,Écuvilly,60,,,60204000AB0137,,,,,,,,,,,,,0,,,,,P,prés,,,960,2.923961,49.645748
2019-895354,2019-08-01,000001,Vente,178000,,,LE VILLAGE,B019,60310,60204,Écuvilly,60,,,60204000AB0196,,,,,,,,,,,,,0,,,,,T,terres,,,792,2.923609,49.645768
2019-895490,2019-08-23,000001,Vente,3000,,,LE QUESNOY,B009,60310,60204,Écuvilly,60,,,602040000B0025,,,,,,,,,,,,,0,,,,,BT,taillis simples,,,3550,2.93107,49.652475
2019-895986,2019-09-17,000001,Vente,106000,4,,RUE DE CANDOR,1200,60310,60204,Écuvilly,60,,,60204000AC0107,,,,,,,,,,,,,0,,,,,S,sols,,,109,2.915418,49.648512
2019-895986,2019-09-17,000001,Vente,106000,2,,RUE DE CANDOR,1200,60310,60204,Écuvilly,60,,,60204000AC0108,,,,,,,,,,,,,0,1,Maison,131,6,S,sols,,,157,2.915471,49.648536
2019-895986,2019-09-17,000001,Vente,106000,,,LE VAL LAMBERT,B018,60310,60204,Écuvilly,60,,,60204000AC0177,,,,,,,,,,,,,0,,,,,S,sols,,,137,2.915142,49.648512
