id_mutation,date_mutation,numero_disposition,nature_mutation,valeur_fonciere,adresse_numero,adresse_suffixe,adresse_nom_voie,adresse_code_voie,code_postal,code_commune,nom_commune,code_departement,ancien_code_commune,ancien_nom_commune,id_parcelle,ancien_id_parcelle,numero_volume,lot1_numero,lot1_surface_carrez,lot2_numero,lot2_surface_carrez,lot3_numero,lot3_surface_carrez,lot4_numero,lot4_surface_carrez,lot5_numero,lot5_surface_carrez,nombre_lots,code_type_local,type_local,surface_reelle_bati,nombre_pieces_principales,code_nature_culture,nature_culture,code_nature_culture_speciale,nature_culture_speciale,surface_terrain,longitude,latitude
2019-888044,2019-06-14,000001,Vente,13890.6,,,LA SALLE EN GRAINS,B023,60134,60426,Montreuil-sur-Thérain,60,,,60426000AA0012,,,,,,,,,,,,,0,,,,,BS,taillis sous futaie,,,584,2.184649,49.382057
2019-888044,2019-06-14,000001,Vente,13890.6,,,SOUS ST ANTOINE,B025,60134,60426,Montreuil-sur-Thérain,60,,,60426000AA0056,,,,,,,,,,,,,0,,,,,BS,taillis sous futaie,,,461,2.187021,49.381818
2019-888044,2019-06-14,000001,Vente,13890.6,,,SOUS ST ANTOINE,B025,60134,60426,Montreuil-sur-Thérain,60,,,60426000AA0070,,,,,,,,,,,,,0,,,,,BS,taillis sous futaie,,,390,2.188762,49.381806
2019-888044,2019-06-14,000001,Vente,13890.6,,,LES REGNIERS,B015,60134,60426,Montreuil-sur-Thérain,60,,,60426000AB0073,,,,,,,,,,,,,0,,,,,BT,taillis simples,,,889,2.192721,49.383348
2019-888044,2019-06-14,000001,Vente,13890.6,,,RUE DU PLANQUET,B017,60134,60426,Montreuil-sur-Thérain,60,,,60426000AC0066,,,,,,,,,,,,,0,,,,,BS,taillis sous futaie,,,254,2.195275,49.381173
2019-888145,2019-06-12,000001,Vente,35000,,,LA COUTURE,B011,60134,60426,Montreuil-sur-Thérain,60,,,60426000AA0041,,,,,,,,,,,,,0,,,,,L,landes,MARAI,Pré marais,15781,2.189529,49.38519
2019-888695,2019-07-29,000001,Vente,240000,96,,IMP DE LA SAULX,0025,60134,60426,Montreuil-sur-Thérain,60,,,60426000AA0031,,,,,,,,,,,,,0,1,Maison,166,6,S,sols,,,500,2.189468,49.383882
2019-888695,2019-07-29,000001,Vente,240000,96,,IMP DE LA SAULX,0025,60134,60426,Montreuil-sur-Thérain,60,,,60426000AA0031,,,,,,,,,,,,,0,1,Maison,166,6,J,jardins,,,976,2.189468,49.383882
