id_mutation,date_mutation,numero_disposition,nature_mutation,valeur_fonciere,adresse_numero,adresse_suffixe,adresse_nom_voie,adresse_code_voie,code_postal,code_commune,nom_commune,code_departement,ancien_code_commune,ancien_nom_commune,id_parcelle,ancien_id_parcelle,numero_volume,lot1_numero,lot1_surface_carrez,lot2_numero,lot2_surface_carrez,lot3_numero,lot3_surface_carrez,lot4_numero,lot4_surface_carrez,lot5_numero,lot5_surface_carrez,nombre_lots,code_type_local,type_local,surface_reelle_bati,nombre_pieces_principales,code_nature_culture,nature_culture,code_nature_culture_speciale,nature_culture_speciale,surface_terrain,longitude,latitude
2019-890858,2019-01-14,000001,Vente,78000,6,B,RUE DU GENERAL MANGIN,0007,60190,60515,Pronleroy,60,,,605150000B1213,,,,,,,,,,,,,0,1,Maison,20,1,S,sols,,,85,2.548818,49.47109
2019-891514,2019-04-26,000001,Vente,10000,,,LE FIEF D AUVILLE,B028,60190,60515,Pronleroy,60,,,60515000ZD0037,,,,,,,,,,,,,0,,,,,T,terres,,,8510,2.524833,49.458634
2019-891554,2019-04-29,000001,Vente,45000,,,LE VILLAGE,B064,60190,60515,Pronleroy,60,,,605150000B1345,,,,,,,,,,,,,0,,,,,P,prés,,,1037,2.549623,49.472171
2019-891988,2019-07-01,000001,Vente,200000,,,LE VILLAGE,B064,60190,60515,Pronleroy,60,,,605150000B0263,,,,,,,,,,,,,0,,,,,J,jardins,,,692,2.545002,49.467948
2019-891988,2019-07-01,000001,Vente,200000,26,,RUE DES PERRIERES,0013,60190,60515,Pronleroy,60,,,605150000B1177,,,,,,,,,,,,,0,1,Maison,120,4,S,sols,,,1137,2.544923,49.467893
2019-892056,2019-06-27,000001,Vente,188000,5,,RUE DE BEAUVAIS,0002,60190,60515,Pronleroy,60,,,605150000B0203,,,,,,,,,,,,,0,1,Maison,136,6,S,sols,,,296,2.54668,49.473753
2019-892056,2019-06-27,000001,Vente,188000,,,LE VILLAGE,B064,60190,60515,Pronleroy,60,,,605150000B0204,,,,,,,,,,,,,0,,,,,J,jardins,,,640,2.546554,49.473523
2019-892056,2019-06-27,000001,Vente,188000,,,LE VILLAGE,B064,60190,60515,Pronleroy,60,,,605150000B1256,,,,,,,,,,,,,0,,,,,J,jardins,,,421,2.546663,49.47346
2019-892056,2019-06-27,000001,Vente,188000,,,LE VILLAGE,B064,60190,60515,Pronleroy,60,,,605150000B1258,,,,,,,,,,,,,0,,,,,S,sols,,,325,2.546789,49.473739
2019-892056,2019-06-27,000001,Vente,188000,,,LE VILLAGE,B064,60190,60515,Pronleroy,60,,,605150000B1261,,,,,,,,,,,,,0,,,,,S,sols,,,41,2.546947,49.473797
2019-892150,2019-07-19,000001,Vente,210000,7,,RUE DU GENERAL MANGIN,0007,60190,60515,Pronleroy,60,,,605150000B0275,,,,,,,,,,,,,0,1,Maison,135,5,S,sols,,,364,2.547733,49.470399
2019-892150,2019-07-19,000001,Vente,210000,,,LE VILLAGE,B064,60190,60515,Pronleroy,60,,,605150000B0277,,,,,,,,,,,,,0,,,,,J,jardins,,,815,2.548196,49.470105
2019-892230,2019-07-26,000001,Vente,110000,3,,RUE DES PERRIERES,0013,60190,60515,Pronleroy,60,,,605150000B1228,,,,,,,,,,,,,0,1,Maison,90,4,S,sols,,,126,2.546494,49.469103
2019-892399,2019-08-28,000001,Vente,73333.33,18,,RUE VERTE,0015,60190,60515,Pronleroy,60,,,605150000B0391,,,,,,,,,,,,,0,1,Maison,55,2,S,sols,,,194,2.553565,49.473621
2019-892399,2019-08-28,000001,Vente,73333.33,,,LE VILLAGE,B064,60190,60515,Pronleroy,60,,,605150000B1102,,,,,,,,,,,,,0,,,,,J,jardins,,,853,2.554328,49.473638
2019-892399,2019-08-28,000001,Vente,73333.33,,,LE VILLAGE,B064,60190,60515,Pronleroy,60,,,605150000B1197,,,,,,,,,,,,,0,,,,,J,jardins,,,118,2.55376,49.473591
2019-892454,2019-08-23,000001,Vente,30169.75,,,LE VILLAGE,B064,60190,60515,Pronleroy,60,,,605150000B1239,,,,,,,,,,,,,0,,,,,AB,terrains a bâtir,,,41,2.552962,49.472297
2019-892454,2019-08-23,000001,Vente,30169.75,,,LE VILLAGE,B064,60190,60515,Pronleroy,60,,,605150000B1241,,,,,,,,,,,,,0,,,,,AB,terrains a bâtir,,,2694,2.553864,49.472139
2019-892454,2019-08-23,000001,Vente,30169.75,,,LA VALLEE VIVROT,B057,60190,60515,Pronleroy,60,,,60515000ZE0016,,,,,,,,,,,,,0,,,,,T,terres,,,18010,2.512978,49.457366
2019-892454,2019-08-23,000001,Vente,30169.75,,,LE VERITATIS,B058,60190,60515,Pronleroy,60,,,60515000ZE0034,,,,,,,,,,,,,0,,,,,T,terres,,,3310,2.515194,49.457847
2019-892454,2019-08-23,000001,Vente,30169.75,,,LE VERITATIS,B058,60190,60515,Pronleroy,60,,,60515000ZE0035,,,,,,,,,,,,,0,,,,,T,terres,,,5270,2.515434,49.457947
2019-892827,2019-10-23,000001,Vente,245000,4,,RUE DE LANEUVILLEROY,0010,60190,60515,Pronleroy,60,,,605150000B0380,,,,,,,,,,,,,0,1,Maison,86,3,S,sols,,,550,2.552308,49.473861
2019-892827,2019-10-23,000001,Vente,245000,,,LE VILLAGE,B064,60190,60515,Pronleroy,60,,,605150000B0381,,,,,,,,,,,,,0,,,,,J,jardins,,,535,2.55254,49.473878
