id_mutation,date_mutation,numero_disposition,nature_mutation,valeur_fonciere,adresse_numero,adresse_suffixe,adresse_nom_voie,adresse_code_voie,code_postal,code_commune,nom_commune,code_departement,ancien_code_commune,ancien_nom_commune,id_parcelle,ancien_id_parcelle,numero_volume,lot1_numero,lot1_surface_carrez,lot2_numero,lot2_surface_carrez,lot3_numero,lot3_surface_carrez,lot4_numero,lot4_surface_carrez,lot5_numero,lot5_surface_carrez,nombre_lots,code_type_local,type_local,surface_reelle_bati,nombre_pieces_principales,code_nature_culture,nature_culture,code_nature_culture_speciale,nature_culture_speciale,surface_terrain,longitude,latitude
2019-902131,2019-01-03,000001,Vente,75000,1,,LE LOGIS,B068,61250,61143,Damigny,61,,,61143000AN0056,,,,,,,,,,,,,0,1,Maison,62,4,S,sols,,,108,0.072349,48.445184
2019-902131,2019-01-03,000001,Vente,75000,,,CRS DU LOGIS,0071,61250,61143,Damigny,61,,,61143000AN0072,,,,,,,,,,,,,0,,,,,S,sols,,,20,0.071024,48.445087
2019-902131,2019-01-03,000001,Vente,75000,,,CRS DU LOGIS,0071,61250,61143,Damigny,61,,,61143000AN0072,,,,,,,,,,,,,0,,,,,J,jardins,,,1283,0.071024,48.445087
2019-902178,2019-01-24,000001,Adjudication,,5,,RUE DU PONT DU FRESNE,0108,61250,61143,Damigny,61,,,61143000AI0015,,,,,,,,,,,,,0,,,,,S,sols,,,158,0.070525,48.442738
2019-902312,2019-01-31,000001,Vente,50000,,,RUE PRINCIPALE,0110,61250,61143,Damigny,61,,,61143000AP0148,,,,,,,,,,,,,0,,,,,P,prés,,,449,0.073067,48.453457
2019-902312,2019-01-31,000001,Vente,50000,,,RUE PRINCIPALE,0110,61250,61143,Damigny,61,,,61143000AP0150,,,,,,,,,,,,,0,,,,,AB,terrains a bâtir,,,706,0.073148,48.453284
2019-902745,2019-02-27,000002,Vente,1,11,,RUE DES HAUTS CHATELETS,0025,61250,61143,Damigny,61,,,61143000AI0198,,,,,,,,,,,,,0,1,Maison,94,4,,,,,,0.07052,48.44057
2019-902946,2019-03-19,000001,Vente,90000,5,,RUE DES HAUTS CHATELETS,0025,61250,61143,Damigny,61,,,61143000AI0067,,,,,,,,,,,,,0,1,Maison,55,3,J,jardins,,,451,0.071123,48.441431
2019-902946,2019-03-19,000001,Vente,90000,5,,RUE DES HAUTS CHATELETS,0025,61250,61143,Damigny,61,,,61143000AI0067,,,,,,,,,,,,,0,1,Maison,55,3,S,sols,,,352,0.071123,48.441431
2019-903009,2019-03-22,000001,Vente,75000,9,,RUE DE LA PAIX,0105,61250,61143,Damigny,61,,,61143000AA0250,,,,,,,,,,,,,0,1,Maison,79,3,S,sols,,,446,0.073228,48.451373
2019-903117,2019-04-02,000001,Vente,15000,,,LA HANTELLE,B058,61250,61143,Damigny,61,,,61143000AR0001,,,,,,,,,,,,,0,,,,,P,prés,,,2721,0.063956,48.459489
2019-903252,2019-03-26,000001,Vente,40000,17,,RUE PRINCIPALE,0110,61250,61143,Damigny,61,,,61143000AN0106,,,,,,,,,,,,,0,1,Maison,42,1,S,sols,,,43,0.072025,48.444
2019-903621,2019-05-02,000001,Vente,130000,32,,RUE DU PRINTEMPS,0115,61250,61143,Damigny,61,,,61143000AI0084,,,,,,,,,,,,,0,1,Maison,86,6,S,sols,,,606,0.072657,48.440244
2019-903621,2019-05-02,000001,Vente,130000,32,,RUE DU PRINTEMPS,0115,61250,61143,Damigny,61,,,61143000AI0118,,,,,,,,,,,,,0,,,,,S,sols,,,20,0.072838,48.440255
2019-903673,2019-04-30,000001,Vente,9000,5002,,IMP DU JARDIN,0058,61250,61143,Damigny,61,,,61143000AN0044,,,,,,,,,,,,,0,3,Dépendance,,0,S,sols,,,19,0.072696,48.445957
2019-903812,2019-05-03,000001,Vente,110000,90,,RUE DE BELLEVUE,0015,61250,61143,Damigny,61,,,61143000AC0097,,,,,,,,,,,,,0,1,Maison,70,4,S,sols,,,736,0.086793,48.454423
2019-903987,2019-05-24,000001,Vente,137000,1,,RUE DE BOURDON,0161,61250,61143,Damigny,61,,,61143000AP0093,,,,,,,,,,,,,0,1,Maison,84,5,S,sols,,,432,0.062444,48.455345
2019-904102,2019-05-23,000001,Vente,145000,3,,ALL RONSARD,0128,61250,61143,Damigny,61,,,61143000AA0285,,,,,,,,,,,,,0,1,Maison,72,4,S,sols,,,584,0.074866,48.451322
2019-904392,2019-06-17,000001,Vente,80000,6,,RUE DE LA MARNE,0075,61250,61143,Damigny,61,,,61143000AC0055,,,,,,,,,,,,,0,1,Maison,70,4,S,sols,,,463,0.083829,48.452874
2019-904452,2019-05-29,000001,Vente,235000,,,RUE LAZARE CARNOT,0060,61250,61143,Damigny,61,,,61143000AD0072,,,,,,,,,,,,,0,,,,,S,sols,,,181,0.086711,48.448042
2019-905025,2019-07-23,000001,Vente,267000,,,CHE DU MILIEU,0090,61250,61143,Damigny,61,,,61143000AE0066,,,,,,,,,,,,,0,,,,,P,prés,,,1020,0.073552,48.447009
2019-905025,2019-07-23,000001,Vente,267000,,,CHE DU MILIEU,0090,61250,61143,Damigny,61,,,61143000AE0068,,,,,,,,,,,,,0,1,Maison,150,3,S,sols,,,1070,0.073652,48.447198
2019-905071,2019-07-10,000001,Vente,500000,68,,RUE LAZARE CARNOT,0060,61250,61143,Damigny,61,,,61143000AD0151,,,,,,,,,,,,,0,4,Local industriel. commercial ou assimilé,1635,0,S,sols,,,6529,0.082258,48.448512
2019-905190,2019-07-24,000001,Vente,180700,8,,RUE HECTOR MALOT,0053,61250,61143,Damigny,61,,,61143000AA0224,,,,,,,,,,,,,0,1,Maison,109,4,S,sols,,,747,0.074724,48.450891
2019-905211,2019-07-19,000001,Vente,162000,8,,IMP DU MOULIN,0097,61250,61143,Damigny,61,,,61143000AP0024,,,,,,,,,,,,,0,1,Maison,116,4,S,sols,,,357,0.071807,48.453479
2019-905429,2019-08-02,000001,Vente,120000,14,,RUE DES GLYCINES,0045,61250,61143,Damigny,61,,,61143000AA0037,,,,,,,,,,,,,0,1,Maison,85,5,S,sols,,,567,0.077827,48.452416
2019-905442,2019-07-30,000001,Vente,96000,13,,RUE CLAUDE MONET,0027,61250,61143,Damigny,61,,,61143000AC0124,,,,,,,,,,,,,0,1,Maison,72,4,S,sols,,,558,0.086403,48.454109
2019-905463,2019-08-12,000001,Vente,180000,16,,ALL GEORGES BIZET,0044,61250,61143,Damigny,61,,,61143000AH0241,,,,,,,,,,,,,0,1,Maison,114,5,S,sols,,,545,0.075802,48.442706
2019-905469,2019-08-08,000001,Vente,38000,7,,RUE PRINCIPALE,0110,61250,61143,Damigny,61,,,61143000AN0192,,,11,,,,,,,,,,1,2,Appartement,31,2,,,,,,0.071526,48.443734
2019-905489,2019-08-08,000001,Vente,134000,,,CRS DE LA BRIANTE,0023,61250,61143,Damigny,61,,,61143000AO0088,,,,,,,,,,,,,0,,,,,S,sols,,,403,0.071749,48.448173
2019-905489,2019-08-08,000001,Vente,134000,2,,CRS DE LA BRIANTE,0023,61250,61143,Damigny,61,,,61143000AO0091,,,,,,,,,,,,,0,1,Maison,76,3,S,sols,,,180,0.072078,48.448135
2019-905554,2019-08-22,000001,Vente,173375,20,,RTE D ECOUVES,0035,61250,61143,Damigny,61,,,61143000AB0003,,,,,,,,,,,,,0,1,Maison,300,7,S,sols,,,158,0.083808,48.456107
2019-905554,2019-08-22,000001,Vente,173375,20,,RTE D ECOUVES,0035,61250,61143,Damigny,61,,,61143000AB0003,,,,,,,,,,,,,0,1,Maison,300,7,AG,terrains d'agrément,,,2300,0.083808,48.456107
2019-905933,2019-08-27,000001,Vente,156000,3,,RUE COROT,0030,61250,61143,Damigny,61,,,61143000AC0151,,,,,,,,,,,,,0,1,Maison,88,5,S,sols,,,513,0.085659,48.453303
2019-906356,2019-09-20,000001,Vente,30000,7,,RUE PRINCIPALE,0110,61250,61143,Damigny,61,,,61143000AN0192,,,7,,,,,,,,,,1,2,Appartement,21,1,,,,,,0.071526,48.443734
2019-906518,2019-09-26,000001,Vente,74000,5587,B,IMP JEAN MONNET,0118,61250,61143,Damigny,61,,,61143000AA0414,,,5,47.38,,,,,,,,,1,2,Appartement,48,2,,,,,,0.074152,48.448753
2019-906611,2019-10-12,000001,Vente,115000,8,,RUE DU HAUT DES CHAMPS,0050,61250,61143,Damigny,61,,,61143000AA0164,,,,,,,,,,,,,0,1,Maison,82,5,S,sols,,,486,0.073692,48.449509
2019-906611,2019-10-12,000001,Vente,115000,7,,RUE PRINCIPALE,0110,61250,61143,Damigny,61,,,61143000AN0192,,,12,,,,,,,,,,1,2,Appartement,31,2,,,,,,0.071526,48.443734
2019-906618,2019-10-09,000001,Vente,139000,81,,RUE DE BELLEVUE,0015,61250,61143,Damigny,61,,,61143000AB0027,,,,,,,,,,,,,0,1,Maison,68,4,S,sols,,,654,0.085493,48.454599
2019-906909,2019-10-31,000001,Vente,3000,,,LA CORNEILLIERE,B029,61250,61143,Damigny,61,,,61143000AO0169,,,,,,,,,,,,,0,,,,,AB,terrains a bâtir,,,616,0.067601,48.450054
2019-907237,2019-11-13,000001,Vente,93000,28,,RUE DES PLATANES,0107,61250,61143,Damigny,61,,,61143000AK0094,,,,,,,,,,,,,0,1,Maison,76,4,S,sols,,,529,0.063736,48.442346
2019-907396,2019-12-05,000001,Vente,402000,,,RUE GEORGES CHAMPETIER,0042,61250,61143,Damigny,61,,,61143000AD0171,,,,,,,,,,,,,0,4,Local industriel. commercial ou assimilé,,0,AB,terrains a bâtir,,,1993,,
2019-907396,2019-12-05,000001,Vente,402000,16,,RUE PAUL GIROD,0126,61250,61143,Damigny,61,,,61143000AD0178,,,,,,,,,,,,,0,4,Local industriel. commercial ou assimilé,273,0,AB,terrains a bâtir,,,3007,,
2019-907400,2019-12-05,000001,Vente,359082,,,RUE GEORGES CHAMPETIER,0042,61250,61143,Damigny,61,,,61143000AD0171,,,,,,,,,,,,,0,4,Local industriel. commercial ou assimilé,,0,AB,terrains a bâtir,,,1993,,
2019-907400,2019-12-05,000001,Vente,359082,16,,RUE PAUL GIROD,0126,61250,61143,Damigny,61,,,61143000AD0178,,,,,,,,,,,,,0,4,Local industriel. commercial ou assimilé,273,0,AB,terrains a bâtir,,,3007,,
2019-907445,2019-11-25,000001,Vente,95000,,,RUE DU PONT DU FRESNE,0108,61250,61143,Damigny,61,,,61143000AN0151,,,,,,,,,,,,,0,,,,,S,sols,,,45,0.071125,48.442792
2019-907445,2019-11-25,000001,Vente,95000,8,,RUE DU PONT DU FRESNE,0108,61250,61143,Damigny,61,,,61143000AN0152,,,,,,,,,,,,,0,4,Local industriel. commercial ou assimilé,149,0,S,sols,,,250,0.071117,48.442886
2019-907445,2019-11-25,000001,Vente,95000,8,,RUE DU PONT DU FRESNE,0108,61250,61143,Damigny,61,,,61143000AN0152,,,,,,,,,,,,,0,1,Maison,118,4,S,sols,,,250,0.071117,48.442886
2019-907503,2019-12-09,000001,Vente,1,,,RTE D ECOUVES,0035,61250,61143,Damigny,61,,,61143000AC0165,,,,,,,,,,,,,0,,,,,S,sols,,,87,0.084841,48.453648
2019-907503,2019-12-09,000001,Vente,1,,,RTE D ECOUVES,0035,61250,61143,Damigny,61,,,61143000AC0166,,,,,,,,,,,,,0,,,,,S,sols,,,67,0.085111,48.45314
2019-907503,2019-12-09,000001,Vente,1,,,RTE D ECOUVES,0035,61250,61143,Damigny,61,,,61143000AC0167,,,,,,,,,,,,,0,,,,,S,sols,,,60,0.085648,48.452374
2019-907680,2019-12-02,000001,Vente,172000,3,,ALL DES PINSONS,0104,61250,61143,Damigny,61,,,61143000AH0112,,,,,,,,,,,,,0,1,Maison,91,4,S,sols,,,660,0.075709,48.440673
2019-907687,2019-12-04,000001,Vente,70000,5,,RLE DE L EGLISE,0036,61250,61143,Damigny,61,,,61143000AA0449,,,,,,,,,,,,,0,1,Maison,70,2,S,sols,,,143,0.07274,48.451175
2019-907742,2019-11-18,000001,Vente,95000,116,,RUE PRINCIPALE,0110,61250,61143,Damigny,61,,,61143000AA0171,,,,,,,,,,,,,0,,,,,S,sols,,,43,0.072671,48.449393
2019-907742,2019-11-18,000001,Vente,95000,7,,RUE PRINCIPALE,0110,61250,61143,Damigny,61,,,61143000AN0192,,,30,,,,,,,,,,1,2,Appartement,30,2,,,,,,0.071526,48.443734
2019-907763,2019-12-13,000001,Vente,125000,2,,ALL ERIK SATIE,0047,61250,61143,Damigny,61,,,61143000AE0083,,,,,,,,,,,,,0,1,Maison,101,4,S,sols,,,520,0.074962,48.444764
2019-907807,2019-12-24,000001,Vente,1,,,RUE DE LA PAIX,0105,61250,61143,Damigny,61,,,61143000AA0205,,,,,,,,,,,,,0,,,,,AB,terrains a bâtir,RUE,Rue,62,0.075566,48.44932
2019-907807,2019-12-24,000001,Vente,1,,,RUE DE LA PAIX,0105,61250,61143,Damigny,61,,,61143000AA0206,,,,,,,,,,,,,0,,,,,AB,terrains a bâtir,RUE,Rue,67,0.075224,48.449559
2019-907965,2019-12-16,000001,Vente,140000,8,,RUE DU HUIT MAI,0055,61250,61143,Damigny,61,,,61143000AC0013,,,,,,,,,,,,,0,1,Maison,74,1,S,sols,,,502,0.080839,48.452919
2019-908142,2019-12-19,000002,Vente,20000,6,,IMP DU JARDIN,0058,61250,61143,Damigny,61,,,61143000AN0262,,,,,,,,,,,,,0,1,Maison,132,3,S,sols,,,244,0.072364,48.446133
