id_mutation,date_mutation,numero_disposition,nature_mutation,valeur_fonciere,adresse_numero,adresse_suffixe,adresse_nom_voie,adresse_code_voie,code_postal,code_commune,nom_commune,code_departement,ancien_code_commune,ancien_nom_commune,id_parcelle,ancien_id_parcelle,numero_volume,lot1_numero,lot1_surface_carrez,lot2_numero,lot2_surface_carrez,lot3_numero,lot3_surface_carrez,lot4_numero,lot4_surface_carrez,lot5_numero,lot5_surface_carrez,nombre_lots,code_type_local,type_local,surface_reelle_bati,nombre_pieces_principales,code_nature_culture,nature_culture,code_nature_culture_speciale,nature_culture_speciale,surface_terrain,longitude,latitude
2019-902248,2019-02-08,000001,Vente,118021.5,,,LA BUFFARDIERE,B835,61290,61230,Longny les Villages,61,,,61230296ZB0029,,,,,,,,,,,,,0,,,,,BS,taillis sous futaie,,,243380,0.745604,48.58442
2019-902248,2019-02-08,000001,Vente,118021.5,,,LA BUFFARDIERE,B835,61290,61230,Longny les Villages,61,,,61230296ZB0030,,,,,,,,,,,,,0,,,,,BT,taillis simples,,,18890,0.748013,48.587242
2019-902352,2019-01-26,000001,Vente,100000,5005,,LOT DE LA BRISARDIERE,A001,61290,61230,Longny les Villages,61,,,61230000ZD0194,,,,,,,,,,,,,0,1,Maison,78,4,S,sols,,,612,0.747856,48.52716
2019-902354,2019-02-09,000001,Vente,87000,31,,RUE DE L EGLISE LONGNY,0200,61290,61230,Longny les Villages,61,,,61230000AC0561,,,,,,,,,,,,,0,2,Appartement,30,2,S,sols,,,77,0.751692,48.529064
2019-902354,2019-02-09,000001,Vente,87000,31,,RUE DE L EGLISE LONGNY,0200,61290,61230,Longny les Villages,61,,,61230000AC0561,,,,,,,,,,,,,0,2,Appartement,30,2,S,sols,,,77,0.751692,48.529064
2019-902354,2019-02-09,000001,Vente,87000,31,,RUE DE L EGLISE LONGNY,0200,61290,61230,Longny les Villages,61,,,61230000AC0561,,,,,,,,,,,,,0,2,Appartement,40,1,S,sols,,,77,0.751692,48.529064
2019-902354,2019-02-09,000001,Vente,87000,31,,RUE DE L EGLISE LONGNY,0200,61290,61230,Longny les Villages,61,,,61230000AC0561,,,,,,,,,,,,,0,2,Appartement,60,2,S,sols,,,77,0.751692,48.529064
2019-902354,2019-02-09,000001,Vente,87000,,,RUE DE L EGLISE LONGNY,0200,61290,61230,Longny les Villages,61,,,61230000AC0562,,,,,,,,,,,,,0,,,,,S,sols,,,23,0.752012,48.528874
2019-902354,2019-02-09,000001,Vente,87000,33,,RUE DE L EGLISE LONGNY,0200,61290,61230,Longny les Villages,61,,,61230000AC0564,,,,,,,,,,,,,0,2,Appartement,49,2,S,sols,,,470,0.751823,48.528967
2019-902354,2019-02-09,000001,Vente,87000,33,,RUE DE L EGLISE LONGNY,0200,61290,61230,Longny les Villages,61,,,61230000AC0564,,,,,,,,,,,,,0,2,Appartement,46,3,S,sols,,,470,0.751823,48.528967
2019-902354,2019-02-09,000001,Vente,87000,33,,RUE DE L EGLISE LONGNY,0200,61290,61230,Longny les Villages,61,,,61230000AC0564,,,,,,,,,,,,,0,2,Appartement,37,3,S,sols,,,470,0.751823,48.528967
2019-902357,2019-02-27,000002,Vente,228084,,,LES REHARDIERES,B146,61290,61230,Longny les Villages,61,,,61230000ZE0125,,,,,,,,,,,,,0,,,,,T,terres,,,18245,0.74493,48.542963
2019-902357,2019-02-27,000002,Vente,228084,,,LES REHARDIERES,B146,61290,61230,Longny les Villages,61,,,61230000ZE0125,,,,,,,,,,,,,0,,,,,T,terres,,,37474,0.74493,48.542963
2019-902467,2019-02-14,000001,Vente,57588,,,LA BUFFARDIERE,B835,61290,61230,Longny les Villages,61,,,61230296ZB0048,,,,,,,,,,,,,0,,,,,P,prés,,,4790,0.751711,48.577276
2019-902467,2019-02-14,000001,Vente,57588,,,LA BUFFARDIERE,B835,61290,61230,Longny les Villages,61,,,61230296ZB0049,,,,,,,,,,,,,0,,,,,P,prés,,,8200,0.751026,48.578057
2019-902467,2019-02-14,000001,Vente,57588,,,L ISLE-EST,B863,61290,61230,Longny les Villages,61,,,61230296ZC0109,,,,,,,,,,,,,0,,,,,BT,taillis simples,,,1950,0.753535,48.574275
2019-902467,2019-02-14,000001,Vente,57588,,,L ISLE-EST,B863,61290,61230,Longny les Villages,61,,,61230296ZC0110,,,,,,,,,,,,,0,,,,,BT,taillis simples,,,5740,0.754955,48.573761
2019-902467,2019-02-14,000001,Vente,57588,,,LE MOTTE,B879,61290,61230,Longny les Villages,61,,,61230296ZE0009,,,,,,,,,,,,,0,,,,,P,prés,,,11400,0.754551,48.57292
2019-902467,2019-02-14,000001,Vente,57588,,,L ISLE-OUEST,B864,61290,61230,Longny les Villages,61,,,61230296ZE0029,,,,,,,,,,,,,0,,,,,P,prés,,,14910,0.742774,48.575614
2019-902467,2019-02-14,000001,Vente,57588,,,L ISLE-OUEST,B864,61290,61230,Longny les Villages,61,,,61230296ZE0030,,,,,,,,,,,,,0,,,,,P,prés,,,36790,0.748459,48.574108
2019-902467,2019-02-14,000001,Vente,57588,,,L ISLE-OUEST,B864,61290,61230,Longny les Villages,61,,,61230296ZE0031,,,,,,,,,,,,,0,,,,,P,prés,,,42590,0.747293,48.57586
2019-902467,2019-02-14,000001,Vente,57588,,,L ISLE-OUEST,B864,61290,61230,Longny les Villages,61,,,61230296ZE0032,,,,,,,,,,,,,0,,,,,P,prés,,,43840,0.749687,48.57479
2019-902467,2019-02-14,000001,Vente,57588,,,L ISLE-OUEST,B864,61290,61230,Longny les Villages,61,,,61230296ZE0036,,,,,,,,,,,,,0,,,,,P,prés,,,850,0.751744,48.573397
2019-902467,2019-02-14,000001,Vente,57588,,,L ISLE-OUEST,B864,61290,61230,Longny les Villages,61,,,61230296ZE0037,,,,,,,,,,,,,0,,,,,P,prés,,,1860,0.75275,48.573437
2019-902467,2019-02-14,000001,Vente,57588,,,L ISLE-OUEST,B864,61290,61230,Longny les Villages,61,,,61230296ZE0038,,,,,,,,,,,,,0,,,,,P,prés,,,640,0.753341,48.573541
2019-902467,2019-02-14,000001,Vente,57588,,,L ISLE-OUEST,B864,61290,61230,Longny les Villages,61,,,61230296ZE0042,,,,,,,,,,,,,0,,,,,P,prés,,,3830,0.753282,48.574029
2019-902467,2019-02-14,000001,Vente,57588,,,L ISLE-OUEST,B864,61290,61230,Longny les Villages,61,,,61230296ZE0059,,,,,,,,,,,,,0,,,,,P,prés,,,2574,0.751503,48.573767
2019-902467,2019-02-14,000001,Vente,57588,,,L ISLE-OUEST,B864,61290,61230,Longny les Villages,61,,,61230296ZE0061,,,,,,,,,,,,,0,,,,,P,prés,,,27902,0.752175,48.575451
2019-902467,2019-02-14,000001,Vente,57588,,,L ISLE-OUEST,B864,61290,61230,Longny les Villages,61,,,61230296ZE0063,,,,,,,,,,,,,0,,,,,S,sols,,,2265,0.752333,48.573594
2019-902497,2019-02-22,000001,Vente,150000,56,A,LES PIECES DE LA PIGEARDRI,B740,61290,61230,Longny les Villages,61,,,612302500K0080,,,,,,,,,,,,,0,1,Maison,125,5,S,sols,,,597,0.781038,48.596258
2019-902497,2019-02-22,000001,Vente,150000,56,A,LES PIECES DE LA PIGEARDRI,B740,61290,61230,Longny les Villages,61,,,612302500K0080,,,,,,,,,,,,,0,1,Maison,125,5,AG,terrains d'agrément,PARC,Parc,4763,0.781038,48.596258
2019-902573,2019-02-14,000001,Vente,137500,56,,LA BROUDIERE LANDE / EURE,B196,61290,61230,Longny les Villages,61,,,61230220ZI0016,,,,,,,,,,,,,0,1,Maison,60,1,P,prés,,,4180,0.87229,48.551761
2019-902573,2019-02-14,000001,Vente,137500,56,,LA BROUDIERE LANDE / EURE,B196,61290,61230,Longny les Villages,61,,,61230220ZI0016,,,,,,,,,,,,,0,1,Maison,60,1,S,sols,,,850,0.87229,48.551761
2019-902573,2019-02-14,000001,Vente,137500,,,LA BROUDIERE LANDE / EURE,B196,61290,61230,Longny les Villages,61,,,61230220ZI0059,,,,,,,,,,,,,0,,,,,P,prés,,,359,0.872042,48.551588
2019-902573,2019-02-14,000001,Vente,137500,,,LA BROUDIERE LANDE / EURE,B196,61290,61230,Longny les Villages,61,,,61230220ZI0061,,,,,,,,,,,,,0,,,,,P,prés,,,50,0.872727,48.551403
2019-902573,2019-02-14,000001,Vente,137500,,,LA BROUDIERE LANDE / EURE,B196,61290,61230,Longny les Villages,61,,,61230220ZI0062,,,,,,,,,,,,,0,,,,,P,prés,,,100,0.872208,48.551462
2019-902621,2019-02-28,000001,Vente,3000,,,LA COTE DE LA BASSE SOLLIE,B648,61290,61230,Longny les Villages,61,,,612302500I0009,,,,,,,,,,,,,0,,,,,BT,taillis simples,,,1760,0.779826,48.592484
2019-902621,2019-02-28,000001,Vente,3000,,,LA COTE DE LA BASSE SOLLIE,B648,61290,61230,Longny les Villages,61,,,612302500I0150,,,,,,,,,,,,,0,,,,,T,terres,,,155,0.779319,48.592281
2019-902622,2019-02-22,000001,Vente,412000,12,,LE MOULIN DES ILES,B170,61290,61230,Longny les Villages,61,,,61230000ZV0002,,,,,,,,,,,,,0,1,Maison,142,5,L,landes,FRICH,Friche,880,0.73816,48.508952
2019-902622,2019-02-22,000001,Vente,412000,12,,LE MOULIN DES ILES,B170,61290,61230,Longny les Villages,61,,,61230000ZV0002,,,,,,,,,,,,,0,1,Maison,142,5,AG,terrains d'agrément,PARC,Parc,2966,0.73816,48.508952
2019-902622,2019-02-22,000001,Vente,412000,12,,LE MOULIN DES ILES,B170,61290,61230,Longny les Villages,61,,,61230000ZV0002,,,,,,,,,,,,,0,1,Maison,142,5,S,sols,,,174,0.73816,48.508952
2019-902622,2019-02-22,000001,Vente,412000,12,,LE MOULIN DES ILES,B170,61290,61230,Longny les Villages,61,,,61230000ZV0002,,,,,,,,,,,,,0,1,Maison,142,5,P,prés,,,2210,0.73816,48.508952
2019-902622,2019-02-22,000001,Vente,412000,,,LES AULNES,B001,61290,61230,Longny les Villages,61,,,61230000ZV0066,,,,,,,,,,,,,0,,,,,AG,terrains d'agrément,PARC,Parc,224,0.738908,48.509368
2019-902641,2019-02-28,000001,Vente,3500,,,LE RICOQUET,B816,61290,61230,Longny les Villages,61,,,61230280ZA0002,,,,,,,,,,,,,0,,,,,BT,taillis simples,,,4700,0.702685,48.522694
2019-902641,2019-02-28,000001,Vente,3500,,,LE RICOQUET,B816,61290,61230,Longny les Villages,61,,,61230280ZA0004,,,,,,,,,,,,,0,,,,,BT,taillis simples,,,4820,0.703949,48.522178
2019-902835,2019-03-16,000001,Vente,16000,2,B,RUE DE LA BRISARDIERE,0035,61290,61230,Longny les Villages,61,,,61230000AC0663,,,,,,,,,,,,,0,,,,,J,jardins,MARAI,Pré marais,4474,0.749236,48.527129
2019-902835,2019-03-16,000001,Vente,16000,2,B,RUE DE LA BRISARDIERE,0035,61290,61230,Longny les Villages,61,,,61230000AC0663,,,,,,,,,,,,,0,,,,,AG,terrains d'agrément,PARC,Parc,422,0.749236,48.527129
2019-902843,2019-03-15,000002,Vente,182000,,,LE MINERAI NEUILLY,C139,61290,61230,Longny les Villages,61,,,61230305ZS0158,,,,,,,,,,,,,0,,,,,S,sols,,,228,0.896481,48.54181
2019-902843,2019-03-15,000002,Vente,182000,5,,LE MINERAI NEUILLY,C139,61290,61230,Longny les Villages,61,,,61230305ZS0204,,,,,,,,,,,,,0,1,Maison,100,2,,,,,,0.895973,48.541604
2019-902843,2019-03-15,000002,Vente,182000,3,C,LE MINERAI NEUILLY,C139,61290,61230,Longny les Villages,61,,,61230305ZS0206,,,,,,,,,,,,,0,3,Dépendance,,0,,,,,,0.89631,48.541192
2019-902843,2019-03-15,000002,Vente,182000,3,C,LE MINERAI NEUILLY,C139,61290,61230,Longny les Villages,61,,,61230305ZS0206,,,,,,,,,,,,,0,1,Maison,145,5,,,,,,0.89631,48.541192
2019-903030,2019-03-29,000001,Vente,197000,3,,LA HARDELLIERE,B695,61290,61230,Longny les Villages,61,,,612302500F0190,,,,,,,,,,,,,0,1,Maison,90,4,S,sols,,,1150,0.82504,48.586662
2019-903030,2019-03-29,000001,Vente,197000,,,LA HARDELLIERE,B695,61290,61230,Longny les Villages,61,,,612302500F0191,,,,,,,,,,,,,0,,,,,P,prés,,,2055,0.825418,48.586219
2019-903038,2019-03-27,000001,Vente,20000,5005,,LA FOIE,B504,61290,61230,Longny les Villages,61,,,61230247ZA0044,,,,,,,,,,,,,0,1,Maison,40,1,S,sols,,,1000,,
2019-903038,2019-03-27,000001,Vente,20000,5005,,LA FOIE,B504,61290,61230,Longny les Villages,61,,,61230247ZA0044,,,,,,,,,,,,,0,3,Dépendance,,0,S,sols,,,1000,,
2019-903038,2019-03-27,000001,Vente,20000,5005,,LA FOIE,B504,61290,61230,Longny les Villages,61,,,61230247ZA0044,,,,,,,,,,,,,0,1,Maison,40,1,BS,taillis sous futaie,,,840,,
2019-903038,2019-03-27,000001,Vente,20000,5005,,LA FOIE,B504,61290,61230,Longny les Villages,61,,,61230247ZA0044,,,,,,,,,,,,,0,3,Dépendance,,0,BT,taillis simples,,,1270,,
2019-903038,2019-03-27,000001,Vente,20000,5005,,LA FOIE,B504,61290,61230,Longny les Villages,61,,,61230247ZA0044,,,,,,,,,,,,,0,1,Maison,40,1,BT,taillis simples,,,1270,,
2019-903038,2019-03-27,000001,Vente,20000,5005,,LA FOIE,B504,61290,61230,Longny les Villages,61,,,61230247ZA0044,,,,,,,,,,,,,0,3,Dépendance,,0,P,prés,,,20418,,
2019-903038,2019-03-27,000001,Vente,20000,5005,,LA FOIE,B504,61290,61230,Longny les Villages,61,,,61230247ZA0044,,,,,,,,,,,,,0,1,Maison,40,1,P,prés,,,20418,,
2019-903038,2019-03-27,000001,Vente,20000,5005,,LA FOIE,B504,61290,61230,Longny les Villages,61,,,61230247ZA0044,,,,,,,,,,,,,0,3,Dépendance,,0,BS,taillis sous futaie,,,840,,
2019-903051,2019-03-30,000001,Vente,44000,,,LA PIECE JEAN FONTENEAU,C235,61290,61230,Longny les Villages,61,,,612303050K0411,,,,,,,,,,,,,0,,,,,AB,terrains a bâtir,,,1004,0.904764,48.542255
2019-903051,2019-03-30,000001,Vente,44000,,,LA PIECE JEAN FONTENEAU,C235,61290,61230,Longny les Villages,61,,,612303050K0412,,,,,,,,,,,,,0,,,,,AB,terrains a bâtir,,,1039,0.904843,48.542452
2019-903244,2019-03-26,000001,Vente,2500,,,LA BRUYERE DU BUAT,B030,61290,61230,Longny les Villages,61,,,61230000ZR0076,,,,,,,,,,,,,0,,,,,T,terres,,,4320,0.77981,48.520862
2019-903245,2019-04-05,000001,Vente,28400,54,,RUE DE CHARTRES,0080,61290,61230,Longny les Villages,61,,,61230000AC0216,,,,,,,,,,,,,0,1,Maison,29,2,S,sols,,,64,0.759986,48.528254
2019-903245,2019-04-05,000001,Vente,28400,,,LE BOURG LONGNY,B020,61290,61230,Longny les Villages,61,,,61230000AC0220,,,,,,,,,,,,,0,,,,,J,jardins,POTAG,Jardin potager,314,0.759626,48.528126
2019-903247,2019-04-05,000001,Vente,114480,39,,LA TOUBELLERIE,B909,61290,61230,Longny les Villages,61,,,612302960F0064,,,,,,,,,,,,,0,1,Maison,83,4,S,sols,,,640,0.774498,48.56095
2019-903247,2019-04-05,000001,Vente,114480,,,LA TOUBELLERIE,B909,61290,61230,Longny les Villages,61,,,612302960F0065,,,,,,,,,,,,,0,,,,,P,prés,,,873,0.774777,48.560941
2019-903250,2019-03-26,000001,Vente,2000,5,,RUE DE LA LIBERTE,0400,61290,61230,Longny les Villages,61,,,61230000AB0120,,,,,,,,,,,,,0,1,Maison,50,2,S,sols,,,83,0.752251,48.532017
2019-903251,2019-03-26,000001,Vente,69000,21,,RUE DE CHARTRES,0080,61290,61230,Longny les Villages,61,,,61230000AC0117,,,,,,,,,,,,,0,1,Maison,55,3,S,sols,,,465,0.757398,48.529196
2019-903251,2019-03-26,000001,Vente,69000,,,LE BOURG LONGNY,B020,61290,61230,Longny les Villages,61,,,61230000AC0196,,,,,,,,,,,,,0,,,,,S,sols,,,19,0.757933,48.528654
2019-903268,2019-03-29,000001,Vente,224500,,,LE GACE,B671,61290,61230,Longny les Villages,61,,,612302500B0054,,,,,,,,,,,,,0,,,,,J,jardins,POTAG,Jardin potager,440,0.794051,48.605175
2019-903268,2019-03-29,000001,Vente,224500,,,LE GACE,B671,61290,61230,Longny les Villages,61,,,612302500B0055,,,,,,,,,,,,,0,,,,,P,prés,,,2100,0.794318,48.605228
2019-903268,2019-03-29,000001,Vente,224500,49,,LE GACE,B671,61290,61230,Longny les Villages,61,,,612302500B0134,,,,,,,,,,,,,0,1,Maison,150,5,S,sols,,,888,0.794271,48.605002
2019-903270,2019-03-30,000002,Vente,65000,,,LE MOULIN DE LA CARRIERE,B807,61290,61230,Longny les Villages,61,,,61230280ZB0131,,,,,,,,,,,,,0,,,,,S,sols,,,101,0.715433,48.498096
2019-903270,2019-03-30,000002,Vente,65000,,,LE MOULIN DE LA CARRIERE,B807,61290,61230,Longny les Villages,61,,,61230280ZB0133,,,,,,,,,,,,,0,,,,,S,sols,,,24,0.715332,48.498057
2019-903270,2019-03-30,000002,Vente,65000,,,LE MOULIN DE LA CARRIERE,B807,61290,61230,Longny les Villages,61,,,61230280ZB0135,,,,,,,,,,,,,0,,,,,P,prés,,,24,0.715301,48.498033
2019-903270,2019-03-30,000002,Vente,65000,,,LE MOULIN DE LA CARRIERE,B807,61290,61230,Longny les Villages,61,,,61230280ZB0136,,,,,,,,,,,,,0,,,,,P,prés,,,11650,0.716385,48.498591
2019-903274,2019-03-30,000001,Vente,152000,12,,LOT DE LA BRISARDIERE,A001,61290,61230,Longny les Villages,61,,,61230000ZD0193,,,,,,,,,,,,,0,1,Maison,77,4,S,sols,,,626,0.74781,48.526976
2019-903438,2019-04-16,000001,Vente,8000,,,LE PONT FESTILE,B133,61290,61230,Longny les Villages,61,,,61230000YA0050,,,,,,,,,,,,,0,,,,,BT,taillis simples,,,8180,0.704913,48.52406
2019-903502,2019-04-27,000001,Vente,62000,,,LE VAL DU TELLIER,B165,61290,61230,Longny les Villages,61,,,61230000ZK0030,,,,,,,,,,,,,0,,,,,T,terres,,,150,0.784305,48.539686
2019-903502,2019-04-27,000001,Vente,62000,521,A,LE VAL DU TELLIER,B165,61290,61230,Longny les Villages,61,,,61230000ZK0031,,,,,,,,,,,,,0,1,Maison,85,3,S,sols,,,640,0.784355,48.539844
2019-903502,2019-04-27,000001,Vente,62000,,,LE VAL DU TELLIER,B165,61290,61230,Longny les Villages,61,,,61230000ZK0039,,,,,,,,,,,,,0,,,,,S,sols,,,580,0.784689,48.539865
2019-903588,2019-05-06,000001,Vente,120000,149,B,LE PRE DE NEUILLY,C259,61290,61230,Longny les Villages,61,,,61230305ZS0191,,,,,,,,,,,,,0,1,Maison,140,3,S,sols,,,1113,0.91039,48.539418
2019-903588,2019-05-06,000001,Vente,120000,149,B,LE PRE DE NEUILLY,C259,61290,61230,Longny les Villages,61,,,61230305ZS0191,,,,,,,,,,,,,0,4,Local industriel. commercial ou assimilé,480,0,S,sols,,,1113,0.91039,48.539418
2019-903588,2019-05-06,000001,Vente,120000,,,LA BASSE MARTINIERE,B934,61290,61230,Longny les Villages,61,,,61230305ZS0197,,,,,,,,,,,,,0,,,,,S,sols,,,145,0.910715,48.539722
2019-903588,2019-05-06,000001,Vente,120000,,,LA BASSE MARTINIERE,B934,61290,61230,Longny les Villages,61,,,61230305ZS0198,,,,,,,,,,,,,0,,,,,AG,terrains d'agrément,PARC,Parc,6399,0.911259,48.539782
2019-903652,2019-04-20,000001,Vente,8000,8,,RUE DE L EGLISE LONGNY,0200,61290,61230,Longny les Villages,61,,,61230000AB0260,,,,,,,,,,,,,0,1,Maison,63,3,S,sols,,,43,0.752304,48.530329
2019-903652,2019-04-20,000001,Vente,8000,,,RUE DE L EGLISE LONGNY,0200,61290,61230,Longny les Villages,61,,,61230000AB0370,,,,,,,,,,,,,0,,,,,S,sols,,,43,0.752048,48.530402
2019-903881,2019-05-14,000001,Vente,68000,25,,RUE ARISTIDE BRIAND,0020,61290,61230,Longny les Villages,61,,,61230000AC0592,,,,,,,,,,,,,0,1,Maison,63,3,S,sols,,,148,0.756338,48.52829
2019-903881,2019-05-14,000001,Vente,68000,27,,RUE ARISTIDE BRIAND,0020,61290,61230,Longny les Villages,61,,,61230000AC0595,,,,,,,,,,,,,0,,,,,S,sols,,,29,0.756389,48.528371
2019-903883,2019-05-18,000001,Vente,5500,24,A,RUE GASTON GIBORY,0300,61290,61230,Longny les Villages,61,,,61230000AB0300,,,,,,,,,,,,,0,3,Dépendance,,0,S,sols,,,34,0.750981,48.529807
2019-903883,2019-05-18,000001,Vente,5500,32,,RUE GASTON GIBORY,0300,61290,61230,Longny les Villages,61,,,61230000AB0432,,,,,,,,,,,,,0,,,,,S,sols,,,172,0.751159,48.529763
2019-903920,2019-05-04,000001,Vente,94000,133,,BECHARDIERE MARCHAINVILLE,B603,61290,61230,Longny les Villages,61,,,612302500B0006,,,,,,,,,,,,,0,1,Maison,112,5,S,sols,,,430,0.792682,48.597007
2019-903920,2019-05-04,000001,Vente,94000,,,BECHARDIERE MARCHAINVILLE,B603,61290,61230,Longny les Villages,61,,,612302500B0153,,,,,,,,,,,,,0,,,,,P,prés,,,155,0.792672,48.5971
2019-904019,2019-05-29,000001,Vente,162000,5052,,LE CHENE D OVILLIERS,B227,61290,61230,Longny les Villages,61,,,61230220ZE0093,,,,,,,,,,,,,0,1,Maison,140,6,S,sols,,,500,0.895764,48.570423
2019-904019,2019-05-29,000001,Vente,162000,5052,,LE CHENE D OVILLIERS,B227,61290,61230,Longny les Villages,61,,,61230220ZE0093,,,,,,,,,,,,,0,1,Maison,140,6,P,prés,,,1606,0.895764,48.570423
2019-904165,2019-05-25,000001,Vente,80000,125,,L ECOTTAY,C048,61290,61230,Longny les Villages,61,,,61230305ZC0082,,,,,,,,,,,,,0,1,Maison,90,4,S,sols,,,93,0.929119,48.548126
2019-904165,2019-05-25,000001,Vente,80000,125,,L ECOTTAY,C048,61290,61230,Longny les Villages,61,,,61230305ZC0082,,,,,,,,,,,,,0,1,Maison,90,4,P,prés,,,2603,0.929119,48.548126
2019-904281,2019-06-07,000001,Vente,77221.8,,,LA LIVARDRIE,B706,61290,61230,Longny les Villages,61,,,612302500E0054,,,,,,,,,,,,,0,,,,,P,prés,,,7335,0.836195,48.598287
2019-904281,2019-06-07,000001,Vente,77221.8,,,LA LIVARDRIE,B706,61290,61230,Longny les Villages,61,,,612302500E0054,,,,,,,,,,,,,0,,,,,P,prés,,,7335,0.836195,48.598287
2019-904281,2019-06-07,000001,Vente,77221.8,,,LA LIVARDRIE,B706,61290,61230,Longny les Villages,61,,,612302500E0055,,,,,,,,,,,,,0,,,,,P,prés,,,14478,0.837166,48.599114
2019-904281,2019-06-07,000001,Vente,77221.8,,,LA LIVARDRIE,B706,61290,61230,Longny les Villages,61,,,612302500E0055,,,,,,,,,,,,,0,,,,,P,prés,,,14477,0.837166,48.599114
2019-904281,2019-06-07,000001,Vente,77221.8,,,LE PARC MARCHAINVILLE,B724,61290,61230,Longny les Villages,61,,,61230250ZD0004,,,,,,,,,,,,,0,,,,,P,prés,,,12728,0.831905,48.594181
2019-904281,2019-06-07,000001,Vente,77221.8,,,LE PARC MARCHAINVILLE,B724,61290,61230,Longny les Villages,61,,,61230250ZD0004,,,,,,,,,,,,,0,,,,,P,prés,,,12727,0.831905,48.594181
2019-904281,2019-06-07,000001,Vente,77221.8,,,CLOS GASSOT,B645,61290,61230,Longny les Villages,61,,,61230250ZD0010,,,,,,,,,,,,,0,,,,,P,prés,,,8116,0.835319,48.597245
2019-904281,2019-06-07,000001,Vente,77221.8,,,CLOS GASSOT,B645,61290,61230,Longny les Villages,61,,,61230250ZD0010,,,,,,,,,,,,,0,,,,,P,prés,,,16234,0.835319,48.597245
2019-904281,2019-06-07,000001,Vente,77221.8,,,CLOS GASSOT,B645,61290,61230,Longny les Villages,61,,,61230250ZD0011,,,,,,,,,,,,,0,,,,,P,prés,,,6627,0.836052,48.597943
2019-904281,2019-06-07,000001,Vente,77221.8,,,CLOS GASSOT,B645,61290,61230,Longny les Villages,61,,,61230250ZD0011,,,,,,,,,,,,,0,,,,,P,prés,,,6626,0.836052,48.597943
2019-904281,2019-06-07,000001,Vente,77221.8,,,CLOS GASSOT,B645,61290,61230,Longny les Villages,61,,,61230250ZD0026,,,,,,,,,,,,,0,,,,,T,terres,,,13654,0.834621,48.596492
2019-904281,2019-06-07,000001,Vente,77221.8,,,CLOS GASSOT,B645,61290,61230,Longny les Villages,61,,,61230250ZD0026,,,,,,,,,,,,,0,,,,,T,terres,,,6826,0.834621,48.596492
2019-904281,2019-06-07,000001,Vente,77221.8,,,CLOS GASSOT,B645,61290,61230,Longny les Villages,61,,,61230250ZD0027,,,,,,,,,,,,,0,,,,,T,terres,,,1540,0.836831,48.596758
2019-904369,2019-06-05,000002,Vente,160772,,,LE CHENAY,B050,61290,61230,Longny les Villages,61,,,61230000ZS0003,,,,,,,,,,,,,0,,,,,P,prés,,,25360,0.755436,48.514394
2019-904369,2019-06-05,000002,Vente,160772,,,LES TROIS BOISSEAUX,B164,61290,61230,Longny les Villages,61,,,61230000ZS0007,,,,,,,,,,,,,0,,,,,T,terres,,,42000,0.751285,48.51401
2019-904369,2019-06-05,000002,Vente,160772,,,LA MARCHANDIERE,B101,61290,61230,Longny les Villages,61,,,61230000ZS0049,,,,,,,,,,,,,0,,,,,T,terres,,,14500,0.753366,48.515979
2019-904369,2019-06-05,000002,Vente,160772,,,LE CHENAY,B050,61290,61230,Longny les Villages,61,,,61230000ZS0094,,,,,,,,,,,,,0,,,,,P,prés,,,10020,0.753936,48.51351
2019-904369,2019-06-05,000002,Vente,160772,,,LE CHENAY,B050,61290,61230,Longny les Villages,61,,,61230000ZS0094,,,,,,,,,,,,,0,,,,,P,prés,,,20044,0.753936,48.51351
2019-904369,2019-06-05,000002,Vente,160772,,,LE PETIT CHENAY,B110,61290,61230,Longny les Villages,61,,,61230000ZT0020,,,,,,,,,,,,,0,,,,,S,sols,,,600,0.753703,48.512429
2019-904369,2019-06-05,000002,Vente,160772,,,LE PETIT CHENAY,B110,61290,61230,Longny les Villages,61,,,61230000ZT0022,,,,,,,,,,,,,0,,,,,P,prés,,,20890,0.755021,48.511847
2019-904369,2019-06-05,000002,Vente,160772,,,LE PETIT CHENAY,B110,61290,61230,Longny les Villages,61,,,61230000ZT0036,,,,,,,,,,,,,0,,,,,P,prés,,,2010,0.754343,48.512253
2019-904369,2019-06-05,000002,Vente,160772,,,LE HAUT BEAUMONT,B088,61290,61230,Longny les Villages,61,,,61230000ZV0036,,,,,,,,,,,,,0,,,,,P,prés,,,64200,0.752211,48.511814
2019-904369,2019-06-05,000002,Vente,160772,588,,LE CHENAY,B050,61290,61230,Longny les Villages,61,,,61230000ZV0037,,,,,,,,,,,,,0,1,Maison,65,2,S,sols,,,1680,0.753155,48.512582
2019-904401,2019-06-11,000001,Vente,29500,,,LES SABLES MOULICENT,B906,61290,61230,Longny les Villages,61,,,612302960F0312,,,,,,,,,,,,,0,,,,,AB,terrains a bâtir,,,2985,0.775806,48.549227
2019-904445,2019-06-05,000001,Vente,1750,,,LE PETIT CHENAY,B110,61290,61230,Longny les Villages,61,,,61230000ZT0035,,,,,,,,,,,,,0,,,,,P,prés,,,3500,0.753591,48.512043
2019-904460,2019-06-24,000001,Vente,203000,,,LE CHATEAU NEUILLY,C015,61290,61230,Longny les Villages,61,,,61230305ZH0004,,,,,,,,,,,,,0,,,,,S,sols,,,1240,0.892707,48.531164
2019-904460,2019-06-24,000001,Vente,203000,4,,LE CHATEAU NEUILLY,C015,61290,61230,Longny les Villages,61,,,61230305ZH0040,,,,,,,,,,,,,0,1,Maison,135,4,S,sols,,,933,0.892135,48.531301
2019-904473,2019-06-15,000001,Vente,57000,64,,LA HASLERIE,C348,61290,61230,Longny les Villages,61,,,61230458ZD0102,,,,,,,,,,,,,0,1,Maison,52,2,S,sols,,,219,0.692558,48.496685
2019-904473,2019-06-15,000001,Vente,57000,,,LA HASLERIE,C348,61290,61230,Longny les Villages,61,,,61230458ZD0173,,,,,,,,,,,,,0,,,,,J,jardins,POTAG,Jardin potager,609,0.692343,48.497076
2019-904473,2019-06-15,000001,Vente,57000,65,,LA HASLERIE,C348,61290,61230,Longny les Villages,61,,,61230458ZD0175,,,,,,,,,,,,,0,1,Maison,77,2,S,sols,,,4,0.692441,48.496671
2019-904473,2019-06-15,000001,Vente,57000,,,LA HASLERIE,C348,61290,61230,Longny les Villages,61,,,61230458ZD0177,,,,,,,,,,,,,0,,,,,J,jardins,POTAG,Jardin potager,521,0.692493,48.496767
2019-904473,2019-06-15,000001,Vente,57000,,,LA HASLERIE,C348,61290,61230,Longny les Villages,61,,,61230458ZD0179,,,,,,,,,,,,,0,,,,,P,prés,,,249,0.692299,48.497188
2019-904480,2019-06-11,000001,Vente,161500,466,,LA ROUGETIERE,B153,61290,61230,Longny les Villages,61,,,61230000ZB0048,,,,,,,,,,,,,0,1,Maison,80,3,S,sols,,,2186,0.712812,48.541664