id_mutation,date_mutation,numero_disposition,nature_mutation,valeur_fonciere,adresse_numero,adresse_suffixe,adresse_nom_voie,adresse_code_voie,code_postal,code_commune,nom_commune,code_departement,ancien_code_commune,ancien_nom_commune,id_parcelle,ancien_id_parcelle,numero_volume,lot1_numero,lot1_surface_carrez,lot2_numero,lot2_surface_carrez,lot3_numero,lot3_surface_carrez,lot4_numero,lot4_surface_carrez,lot5_numero,lot5_surface_carrez,nombre_lots,code_type_local,type_local,surface_reelle_bati,nombre_pieces_principales,code_nature_culture,nature_culture,code_nature_culture_speciale,nature_culture_speciale,surface_terrain,longitude,latitude
2019-902977,2019-03-14,000001,Vente,50000,,,LES LANDES,B062,61290,61242,Le Mage,61,,,612420000G0040,,,,,,,,,,,,,0,,,,,P,prés,,,12920,0.803204,48.505148
2019-902977,2019-03-14,000001,Vente,50000,,,LES LANDES,B062,61290,61242,Le Mage,61,,,612420000G0146,,,,,,,,,,,,,0,,,,,P,prés,,,2345,0.80261,48.504987
2019-902977,2019-03-14,000001,Vente,50000,,,LES LANDES,B062,61290,61242,Le Mage,61,,,612420000G0147,,,,,,,,,,,,,0,,,,,P,prés,,,10455,0.802792,48.50457
2019-902977,2019-03-14,000001,Vente,50000,,,LA BIGOTTE,B010,61290,61242,Le Mage,61,,,612420000G0150,,,,,,,,,,,,,0,,,,,P,prés,,,7318,0.800372,48.504729
2019-902977,2019-03-14,000001,Vente,50000,,,LES LANDES,B062,61290,61242,Le Mage,61,,,612420000G0168,,,,,,,,,,,,,0,,,,,P,prés,,,33130,0.805882,48.504915
2019-904970,2019-07-04,000001,Vente,76400,4,,RLE DU HAUT CHENE,0007,61290,61242,Le Mage,61,,,61242000AB0087,,,,,,,,,,,,,0,1,Maison,119,4,S,sols,,,174,0.805207,48.508106
2019-905097,2019-07-26,000001,Vente,405000,110,,LES NOYERS,B072,61290,61242,Le Mage,61,,,612420000E0101,,,,,,,,,,,,,0,1,Maison,200,7,S,sols,,,147,0.80218,48.494872
2019-905097,2019-07-26,000001,Vente,405000,,,LES NOYERS,B072,61290,61242,Le Mage,61,,,612420000E0103,,,,,,,,,,,,,0,,,,,S,sols,,,30,0.802405,48.494777
2019-905097,2019-07-26,000001,Vente,405000,5031,,LES NOYERS,B072,61290,61242,Le Mage,61,,,612420000E0104,,,,,,,,,,,,,0,1,Maison,92,4,P,prés,,,800,0.802829,48.494528
2019-905097,2019-07-26,000001,Vente,405000,5031,,LES NOYERS,B072,61290,61242,Le Mage,61,,,612420000E0104,,,,,,,,,,,,,0,1,Maison,92,4,S,sols,,,500,0.802829,48.494528
2019-905097,2019-07-26,000001,Vente,405000,,,LES NOYERS,B072,61290,61242,Le Mage,61,,,612420000E0105,,,,,,,,,,,,,0,,,,,T,terres,,,920,0.802709,48.494472
2019-905097,2019-07-26,000001,Vente,405000,,,LES NOYERS,B072,61290,61242,Le Mage,61,,,612420000E0106,,,,,,,,,,,,,0,,,,,T,terres,,,1875,0.80255,48.4945
2019-905097,2019-07-26,000001,Vente,405000,,,LES NOYERS,B072,61290,61242,Le Mage,61,,,612420000E0364,,,,,,,,,,,,,0,,,,,S,sols,,,296,0.802173,48.494826
2019-905106,2019-07-05,000001,Vente,110000,41,,RUE GRANDE RUE,0005,61290,61242,Le Mage,61,,,61242000AB0200,,,,,,,,,,,,,0,1,Maison,74,4,S,sols,,,217,0.800487,48.511468
2019-905106,2019-07-05,000001,Vente,110000,41,,RUE GRANDE RUE,0005,61290,61242,Le Mage,61,,,61242000AB0200,,,,,,,,,,,,,0,1,Maison,74,4,J,jardins,,,553,0.800487,48.511468
2019-905106,2019-07-05,000001,Vente,110000,,,LE VIEUX MOULIN,B091,61290,61242,Le Mage,61,,,612420000G0129,,,,,,,,,,,,,0,,,,,P,prés,,,3346,0.799806,48.511498
2019-905106,2019-07-05,000001,Vente,110000,,,LE VIEUX MOULIN,B091,61290,61242,Le Mage,61,,,612420000G0132,,,,,,,,,,,,,0,,,,,BP,peupleraies,,,884,0.79966,48.511494
2019-906020,2019-09-11,000001,Vente,30552,,,LA PLAINE DU MAGE,B080,61290,61242,Le Mage,61,,,612420000A0130,,,,,,,,,,,,,0,,,,,T,terres,,,4300,0.807225,48.511167
2019-906020,2019-09-11,000001,Vente,30552,,,LA PLAINE DU MAGE,B080,61290,61242,Le Mage,61,,,612420000A0131,,,,,,,,,,,,,0,,,,,BT,taillis simples,,,1470,0.807828,48.511766
2019-906020,2019-09-11,000001,Vente,30552,,,LA PLAINE DU MAGE,B080,61290,61242,Le Mage,61,,,612420000A0134,,,,,,,,,,,,,0,,,,,P,prés,,,9480,0.8085,48.511044
2019-906020,2019-09-11,000001,Vente,30552,,,LA PLAINE DU MAGE,B080,61290,61242,Le Mage,61,,,612420000A0135,,,,,,,,,,,,,0,,,,,T,terres,,,3100,0.809504,48.512282
2019-906020,2019-09-11,000001,Vente,30552,,,LA PLAINE DU MAGE,B080,61290,61242,Le Mage,61,,,612420000A0136,,,,,,,,,,,,,0,,,,,BT,taillis simples,,,3840,0.809076,48.512356
2019-906020,2019-09-11,000001,Vente,30552,,,LA PLAINE DU MAGE,B080,61290,61242,Le Mage,61,,,612420000A0137,,,,,,,,,,,,,0,,,,,P,prés,,,3530,0.808702,48.512209
2019-906020,2019-09-11,000001,Vente,30552,,,LA PLAINE DU MAGE,B080,61290,61242,Le Mage,61,,,612420000A0138,,,,,,,,,,,,,0,,,,,T,terres,,,1160,0.808395,48.512224
2019-906020,2019-09-11,000001,Vente,30552,,,LA PLAINE DU MAGE,B080,61290,61242,Le Mage,61,,,612420000A0139,,,,,,,,,,,,,0,,,,,T,terres,,,5290,0.807947,48.512361
2019-906020,2019-09-11,000001,Vente,30552,,,LA PLAINE DU MAGE,B080,61290,61242,Le Mage,61,,,612420000A0140,,,,,,,,,,,,,0,,,,,T,terres,,,10510,0.806989,48.511943
2019-906020,2019-09-11,000001,Vente,30552,,,LA PLAINE DU MAGE,B080,61290,61242,Le Mage,61,,,612420000A0141,,,,,,,,,,,,,0,,,,,T,terres,,,5665,0.806089,48.512135
2019-906020,2019-09-11,000001,Vente,30552,,,LA PLAINE DU MAGE,B080,61290,61242,Le Mage,61,,,612420000A0270,,,,,,,,,,,,,0,,,,,T,terres,,,7160,0.805944,48.511867
2019-906020,2019-09-11,000001,Vente,30552,,,LA PLAINE DU MAGE,B080,61290,61242,Le Mage,61,,,612420000A0271,,,,,,,,,,,,,0,,,,,T,terres,,,5015,0.805637,48.51325
2019-906020,2019-09-11,000001,Vente,30552,,,LA PLAINE DU MAGE,B080,61290,61242,Le Mage,61,,,612420000A0272,,,,,,,,,,,,,0,,,,,T,terres,,,3130,0.806111,48.513222
2019-906166,2019-09-21,000001,Vente,110000,,,LA DOUVELLERIE,B033,61290,61242,Le Mage,61,,,612420000B0207,,,,,,,,,,,,,0,,,,,J,jardins,,,550,0.817591,48.513246
2019-906166,2019-09-21,000001,Vente,110000,90,,LA DOUVELLERIE,B033,61290,61242,Le Mage,61,,,612420000B0208,,,,,,,,,,,,,0,1,Maison,120,4,S,sols,,,340,0.817298,48.513232
2019-906283,2019-09-17,000001,Vente,73000,19,,RUE GRANDE RUE,0005,61290,61242,Le Mage,61,,,61242000AB0142,,,,,,,,,,,,,0,1,Maison,30,1,S,sols,,,111,0.802995,48.509232
2019-906283,2019-09-17,000001,Vente,73000,,,LE BOURG,B017,61290,61242,Le Mage,61,,,61242000AB0187,,,,,,,,,,,,,0,,,,,J,jardins,,,147,0.802342,48.509068
2019-906291,2019-09-14,000001,Vente,53000,,,LA DOUVELLERIE D EN BAS,B034,61290,61242,Le Mage,61,,,612420000A0080,,,,,,,,,,,,,0,,,,,P,prés,,,1720,0.815235,48.513095
2019-906291,2019-09-14,000001,Vente,53000,,,LA DOUVELLERIE,B033,61290,61242,Le Mage,61,,,612420000B0215,,,,,,,,,,,,,0,,,,,S,sols,,,42,0.814777,48.512528
2019-906291,2019-09-14,000001,Vente,53000,,,LA DOUVELLERIE,B033,61290,61242,Le Mage,61,,,612420000B0216,,,,,,,,,,,,,0,,,,,P,prés,,,4260,0.815088,48.512496
2019-906291,2019-09-14,000001,Vente,53000,89,,LA DOUVELLERIE,B033,61290,61242,Le Mage,61,,,612420000B0217,,,,,,,,,,,,,0,1,Maison,64,2,S,sols,,,330,0.81545,48.512955
2019-906291,2019-09-14,000001,Vente,53000,,,LA DOUVELLERIE,B033,61290,61242,Le Mage,61,,,612420000B0218,,,,,,,,,,,,,0,,,,,J,jardins,,,721,0.815766,48.512892
2019-906291,2019-09-14,000001,Vente,53000,,,LA DOUVELLERIE,B033,61290,61242,Le Mage,61,,,612420000B0219,,,,,,,,,,,,,0,,,,,S,sols,,,490,0.815764,48.513012
2019-907233,2019-11-23,000001,Vente,4537,,,LA HAUTE FERRETTE,B054,61290,61242,Le Mage,61,,,612420000B0094,,,,,,,,,,,,,0,,,,,P,prés,,,4960,0.847355,48.508054
2019-907233,2019-11-23,000001,Vente,4537,,,LA HAUTE FERRETTE,B054,61290,61242,Le Mage,61,,,612420000B0095,,,,,,,,,,,,,0,,,,,BT,taillis simples,,,3620,0.847252,48.508292
2019-907233,2019-11-23,000001,Vente,4537,,,LA HAUTE FERRETTE,B054,61290,61242,Le Mage,61,,,612420000B0096,,,,,,,,,,,,,0,,,,,T,terres,,,4140,0.846494,48.508423
2019-907646,2019-11-30,000001,Vente,7000,,,LE VIEUX MOULIN,B091,61290,61242,Le Mage,61,,,612420000G0007,,,,,,,,,,,,,0,,,,,P,prés,,,1320,0.798697,48.511556
2019-907646,2019-11-30,000001,Vente,7000,,,LE VIEUX MOULIN,B091,61290,61242,Le Mage,61,,,612420000G0008,,,,,,,,,,,,,0,,,,,P,prés,,,1410,0.798859,48.51152
2019-907646,2019-11-30,000001,Vente,7000,,,LE VIEUX MOULIN,B091,61290,61242,Le Mage,61,,,612420000G0009,,,,,,,,,,,,,0,,,,,P,prés,,,940,0.799026,48.511447
2019-907646,2019-11-30,000001,Vente,7000,,,LE VIEUX MOULIN,B091,61290,61242,Le Mage,61,,,612420000G0143,,,,,,,,,,,,,0,,,,,P,prés,,,9030,0.797821,48.511961
2019-907646,2019-11-30,000001,Vente,7000,,,LE VIEUX MOULIN,B091,61290,61242,Le Mage,61,,,612420000G0186,,,,,,,,,,,,,0,,,,,P,prés,,,1964,0.799335,48.512148
2019-907677,2019-12-05,000001,Vente,13000,,,MARIMBERT,B067,61290,61242,Le Mage,61,,,612420000E0454,,,,,,,,,,,,,0,,,,,P,prés,,,9963,0.806335,48.492652
2019-907677,2019-12-05,000001,Vente,13000,,,MARIMBERT,B067,61290,61242,Le Mage,61,,,612420000E0454,,,,,,,,,,,,,0,,,,,P,prés,,,9964,0.806335,48.492652
2019-908537,2019-01-19,000001,Vente,85500,12,,RUE GRANDE RUE,0005,61290,61242,Le Mage,61,,,61242000AB0102,,,,,,,,,,,,,0,1,Maison,140,6,S,sols,,,192,0.804612,48.507836
2019-908546,2019-01-10,000001,Vente,32000,28,,RUE GRANDE RUE,0005,61290,61242,Le Mage,61,,,61242000AB0036,,,,,,,,,,,,,0,1,Maison,70,3,S,sols,,,335,0.803557,48.509112
