id_mutation,date_mutation,numero_disposition,nature_mutation,valeur_fonciere,adresse_numero,adresse_suffixe,adresse_nom_voie,adresse_code_voie,code_postal,code_commune,nom_commune,code_departement,ancien_code_commune,ancien_nom_commune,id_parcelle,ancien_id_parcelle,numero_volume,lot1_numero,lot1_surface_carrez,lot2_numero,lot2_surface_carrez,lot3_numero,lot3_surface_carrez,lot4_numero,lot4_surface_carrez,lot5_numero,lot5_surface_carrez,nombre_lots,code_type_local,type_local,surface_reelle_bati,nombre_pieces_principales,code_nature_culture,nature_culture,code_nature_culture_speciale,nature_culture_speciale,surface_terrain,longitude,latitude
2019-903794,2019-04-25,000001,Vente,105000,4,,POMMAINVILLE,B199,61200,61314,Occagnes,61,,,61314000AK0025,,,,,,,,,,,,,0,1,Maison,67,3,S,sols,,,744,-0.062221,48.798724
2019-904591,2019-07-01,000001,Vente,141000,2,,BELLE VUE,B015,61200,61314,Occagnes,61,,,61314000ZD0061,,,,,,,,,,,,,0,1,Maison,167,5,S,sols,,,615,-0.066091,48.777008
2019-904777,2019-06-19,000001,Vente,32000,,,SUR LES CHAMPS,B034,61200,61314,Occagnes,61,,,61314000AC0102,,,,,,,,,,,,,0,,,,,AB,terrains a bâtir,,,838,-0.066937,48.775678
2019-905047,2019-07-05,000001,Vente,1500,,,SUR LES CHAMPS,B034,61200,61314,Occagnes,61,,,61314000AC0120,,,,,,,,,,,,,0,,,,,S,sols,,,130,-0.066201,48.776548
2019-906827,2019-10-04,000001,Vente,135000,7,,LE FAVRIL,B071,61200,61314,Occagnes,61,,,61314000ZA0011,,,,,,,,,,,,,0,1,Maison,136,5,S,sols,,,1000,-0.063553,48.798633
2019-906986,2019-10-29,000001,Vente,165000,4,,BELLE VUE,B015,61200,61314,Occagnes,61,,,61314000ZD0077,,,,,,,,,,,,,0,1,Maison,98,3,P,prés,,,853,-0.065751,48.776839
2019-906986,2019-10-29,000001,Vente,165000,4,,BELLE VUE,B015,61200,61314,Occagnes,61,,,61314000ZD0077,,,,,,,,,,,,,0,1,Maison,98,3,S,sols,,,867,-0.065751,48.776839
2019-906986,2019-10-29,000001,Vente,165000,,,LA MARETTE,B122,61200,61314,Occagnes,61,,,61314000ZD0078,,,,,,,,,,,,,0,,,,,P,prés,,,530,-0.065592,48.776919
2019-907381,2019-11-27,000001,Vente,77000,,,LES ATTESSES,B004,61200,61314,Occagnes,61,,,61314000ZA0031,,,,,,,,,,,,,0,,,,,P,prés,,,37110,,
2019-907381,2019-11-27,000001,Vente,77000,,,CRELU,B055,61200,61314,Occagnes,61,,,61314000ZA0051,,,,,,,,,,,,,0,,,,,P,prés,,,17725,-0.064695,48.809362
2019-907381,2019-11-27,000001,Vente,77000,,,CRELU,B055,61200,61314,Occagnes,61,,,61314000ZA0062,,,,,,,,,,,,,0,,,,,S,sols,,,40,-0.065072,48.810015
2019-907619,2019-11-27,000001,Vente,75000,1,,ROUTE DE TRUN,B202,61200,61314,Occagnes,61,,,61314000AB0045,,,,,,,,,,,,,0,1,Maison,80,4,S,sols,,,1000,-0.071601,48.781265
2019-907619,2019-11-27,000001,Vente,75000,1,,ROUTE DE TRUN,B202,61200,61314,Occagnes,61,,,61314000AB0045,,,,,,,,,,,,,0,1,Maison,80,4,J,jardins,POTAG,Jardin potager,735,-0.071601,48.781265
2019-907625,2019-12-03,000001,Vente,15000,,,LA MARETTE,B122,61200,61314,Occagnes,61,,,61314000ZD0023,,,,,,,,,,,,,0,,,,,S,sols,,,60,-0.061859,48.774474
2019-907625,2019-12-03,000001,Vente,15000,,,LA MARETTE,B122,61200,61314,Occagnes,61,,,61314000ZD0023,,,,,,,,,,,,,0,,,,,P,prés,,,9640,-0.061859,48.774474
2019-908316,2019-01-23,000001,Vente,188600,,,BRUYERE DE BEAUMONT,B022,61200,61314,Occagnes,61,,,613140000B0006,,,,,,,,,,,,,0,,,,,BR,futaies résineuses,PIN,Pins,1860,-0.043543,48.791287
2019-908316,2019-01-23,000001,Vente,188600,,,LE PRE,B154,61200,61314,Occagnes,61,,,613140000B0020,,,,,,,,,,,,,0,,,,,P,prés,,,61650,-0.042163,48.785761
2019-908316,2019-01-23,000001,Vente,188600,,,LA CHESNAIE,B040,61200,61314,Occagnes,61,,,613140000B0021,,,,,,,,,,,,,0,,,,,P,prés,,,38050,-0.044384,48.785514
2019-908316,2019-01-23,000001,Vente,188600,,,LE BECHET,B014,61200,61314,Occagnes,61,,,613140000B0022,,,,,,,,,,,,,0,,,,,E,eaux,MARE,Mare,1120,-0.042154,48.786631
2019-908316,2019-01-23,000001,Vente,188600,,,LE BECHET,B014,61200,61314,Occagnes,61,,,613140000B0023,,,,,,,,,,,,,0,,,,,P,prés,,,1120,-0.042021,48.786893
2019-908316,2019-01-23,000001,Vente,188600,,,LE BECHET,B014,61200,61314,Occagnes,61,,,613140000B0024,,,,,,,,,,,,,0,,,,,P,prés,,,1690,-0.04192,48.787155
2019-908316,2019-01-23,000001,Vente,188600,,,LE BECHET,B014,61200,61314,Occagnes,61,,,613140000B0025,,,,,,,,,,,,,0,,,,,P,prés,,,1615,-0.042157,48.787236
2019-908316,2019-01-23,000001,Vente,188600,,,LE BECHET,B014,61200,61314,Occagnes,61,,,613140000B0026,,,,,,,,,,,,,0,,,,,S,sols,,,2640,-0.041256,48.787169
2019-908316,2019-01-23,000001,Vente,188600,,,L HERBAGE,B102,61200,61314,Occagnes,61,,,613140000B0027,,,,,,,,,,,,,0,,,,,P,prés,,,69345,-0.041624,48.78803
2019-908316,2019-01-23,000001,Vente,188600,,,LA GARENNE,B085,61200,61314,Occagnes,61,,,613140000B0028,,,,,,,,,,,,,0,,,,,BS,taillis sous futaie,,,5440,-0.043795,48.789709
2019-908316,2019-01-23,000001,Vente,188600,,,LA COUTURE,B054,61200,61314,Occagnes,61,,,613140000B0029,,,,,,,,,,,,,0,,,,,P,prés,,,163470,-0.045329,48.789442
