id_mutation,date_mutation,numero_disposition,nature_mutation,valeur_fonciere,adresse_numero,adresse_suffixe,adresse_nom_voie,adresse_code_voie,code_postal,code_commune,nom_commune,code_departement,ancien_code_commune,ancien_nom_commune,id_parcelle,ancien_id_parcelle,numero_volume,lot1_numero,lot1_surface_carrez,lot2_numero,lot2_surface_carrez,lot3_numero,lot3_surface_carrez,lot4_numero,lot4_surface_carrez,lot5_numero,lot5_surface_carrez,nombre_lots,code_type_local,type_local,surface_reelle_bati,nombre_pieces_principales,code_nature_culture,nature_culture,code_nature_culture_speciale,nature_culture_speciale,surface_terrain,longitude,latitude
2019-934383,2019-02-28,000001,Vente,110000,74,,RUE PRINCIPALE,0165,62550,62058,Aumerval,62,,,62058000AB0053,,,,,,,,,,,,,0,1,Maison,162,5,S,sols,,,705,2.405548,50.507624
2019-934383,2019-02-28,000001,Vente,110000,,,LE VILLAGE,B037,62550,62058,Aumerval,62,,,62058000AB0054,,,,,,,,,,,,,0,,,,,P,prés,,,2633,2.405852,50.507204
2019-934904,2019-07-01,000001,Vente,199000,82,,RUE PRINCIPALE,0165,62550,62058,Aumerval,62,,,62058000AB0045,,,,,,,,,,,,,0,1,Maison,132,4,S,sols,,,820,2.406484,50.507992
2019-934904,2019-07-01,000001,Vente,199000,,,LE VILLAGE,B037,62550,62058,Aumerval,62,,,62058000AB0063,,,,,,,,,,,,,0,,,,,S,sols,,,24,2.406655,50.507717
2019-934904,2019-07-01,000001,Vente,199000,,,LE VILLAGE,B037,62550,62058,Aumerval,62,,,62058000AB0063,,,,,,,,,,,,,0,,,,,J,jardins,,,560,2.406655,50.507717
2019-934923,2019-07-15,000001,Vente,190000,23,,RUE DE PERNES,0150,62550,62058,Aumerval,62,,,620580000B0222,,,,,,,,,,,,,0,1,Maison,125,4,S,sols,,,1000,2.396641,50.504204
2019-934923,2019-07-15,000001,Vente,190000,23,,RUE DE PERNES,0150,62550,62058,Aumerval,62,,,620580000B0222,,,,,,,,,,,,,0,1,Maison,125,4,J,jardins,,,2335,2.396641,50.504204
2019-935041,2019-07-27,000001,Vente,26000,,,LES GRANDS ENCLOS,B022,62550,62058,Aumerval,62,,,620580000A0046,,,,,,,,,,,,,0,,,,,T,terres,,,3260,2.41287,50.510564
2019-935041,2019-07-27,000001,Vente,26000,,,LE PAYS A PART,B028,62550,62058,Aumerval,62,,,620580000A0098,,,,,,,,,,,,,0,,,,,T,terres,,,4290,2.425883,50.509767
2019-935041,2019-07-27,000001,Vente,26000,,,LES COURTISEAUX,B012,62550,62058,Aumerval,62,,,620580000B0153,,,,,,,,,,,,,0,,,,,P,prés,,,902,2.406882,50.504008
2019-935041,2019-07-27,000001,Vente,26000,,,LE FOND DU VAUDON,B019,62550,62058,Aumerval,62,,,620580000B0265,,,,,,,,,,,,,0,,,,,T,terres,,,1257,2.394087,50.499326
2019-935041,2019-07-27,000001,Vente,26000,,,LE TROU GUILLAUME SART,B033,62550,62058,Aumerval,62,,,620580000B0342,,,,,,,,,,,,,0,,,,,BT,taillis simples,,,2400,2.393185,50.497195
2019-935041,2019-07-27,000001,Vente,26000,,,LE TROU GUILLAUME SART,B033,62550,62058,Aumerval,62,,,620580000B0355,,,,,,,,,,,,,0,,,,,BT,taillis simples,,,2020,2.393856,50.496797
2019-935041,2019-07-27,000001,Vente,26000,,,LE VOLCAIL,B039,62550,62058,Aumerval,62,,,620580000B0440,,,,,,,,,,,,,0,,,,,T,terres,,,4287,2.399674,50.496946
2019-935041,2019-07-27,000001,Vente,26000,,,LES FLANDRES,B018,62550,62058,Aumerval,62,,,620580000B0530,,,,,,,,,,,,,0,,,,,BF,futaies feuillues,,,1960,2.408234,50.498979
2019-935041,2019-07-27,000001,Vente,26000,,,LES FLANDRES,B018,62550,62058,Aumerval,62,,,620580000B0532,,,,,,,,,,,,,0,,,,,BT,taillis simples,,,3380,2.409023,50.498945
2019-935041,2019-07-27,000001,Vente,26000,,,LES FLANDRES,B018,62550,62058,Aumerval,62,,,620580000B0536,,,,,,,,,,,,,0,,,,,T,terres,,,2130,2.408791,50.497404
2019-935253,2019-09-27,000001,Vente,17880,,,LE VAUDON,B035,62550,62058,Aumerval,62,,,620580000B0284,,,,,,,,,,,,,0,,,,,BT,taillis simples,,,1776,2.389889,50.499826
