id_mutation,date_mutation,numero_disposition,nature_mutation,valeur_fonciere,adresse_numero,adresse_suffixe,adresse_nom_voie,adresse_code_voie,code_postal,code_commune,nom_commune,code_departement,ancien_code_commune,ancien_nom_commune,id_parcelle,ancien_id_parcelle,numero_volume,lot1_numero,lot1_surface_carrez,lot2_numero,lot2_surface_carrez,lot3_numero,lot3_surface_carrez,lot4_numero,lot4_surface_carrez,lot5_numero,lot5_surface_carrez,nombre_lots,code_type_local,type_local,surface_reelle_bati,nombre_pieces_principales,code_nature_culture,nature_culture,code_nature_culture_speciale,nature_culture_speciale,surface_terrain,longitude,latitude
2019-928289,2019-04-29,000001,Vente,230000,,,LE VILLAGE,B033,62170,62207,Campigneulles-les-Petites,62,,,622070000A0166,,,,,,,,,,,,,0,,,,,S,sols,,,77,1.734766,50.446114
2019-928289,2019-04-29,000001,Vente,230000,,,LE VILLAGE,B033,62170,62207,Campigneulles-les-Petites,62,,,622070000A0166,,,,,,,,,,,,,0,,,,,J,jardins,,,533,1.734766,50.446114
2019-928289,2019-04-29,000001,Vente,230000,,,LE VILLAGE,B033,62170,62207,Campigneulles-les-Petites,62,,,622070000A0167,,,,,,,,,,,,,0,,,,,P,prés,,,1049,1.734292,50.446407
2019-928289,2019-04-29,000001,Vente,230000,9,,RUE DU CENTRE,0060,62170,62207,Campigneulles-les-Petites,62,,,622070000A0535,,,,,,,,,,,,,0,1,Maison,108,2,S,sols,,,466,1.734869,50.446039
2019-928289,2019-04-29,000001,Vente,230000,,,LE VILLAGE,B033,62170,62207,Campigneulles-les-Petites,62,,,622070000A0536,,,,,,,,,,,,,0,,,,,S,sols,,,15,1.734499,50.446286
2019-928458,2019-04-24,000001,Vente,500000,,,LE VILLAGE,B033,62170,62207,Campigneulles-les-Petites,62,,,622070000A0610,,,,,,,,,,,,,0,,,,,AB,terrains a bâtir,,,929,1.737054,50.445577
2019-928458,2019-04-24,000001,Vente,500000,8,,RES DES MOUCHETS,A026,62170,62207,Campigneulles-les-Petites,62,,,622070000A0611,,,,,,,,,,,,,0,1,Maison,200,6,S,sols,,,978,1.73722,50.44548
2019-928569,2019-05-07,000001,Vente,165000,9,,RUE DES MOUCHETS,0215,62170,62207,Campigneulles-les-Petites,62,,,622070000A0414,,,,,,,,,,,,,0,1,Maison,86,4,J,jardins,,,743,1.73816,50.444718
2019-928569,2019-05-07,000001,Vente,165000,9,,RUE DES MOUCHETS,0215,62170,62207,Campigneulles-les-Petites,62,,,622070000A0414,,,,,,,,,,,,,0,1,Maison,86,4,S,sols,,,450,1.73816,50.444718
2019-929232,2019-07-17,000001,Vente,80000,60,,RES DU MOULIN,A030,62170,62207,Campigneulles-les-Petites,62,,,622070000A0299,,,,,,,,,,,,,0,1,Maison,92,5,J,jardins,,,862,1.748322,50.451741
2019-929232,2019-07-17,000001,Vente,80000,60,,RES DU MOULIN,A030,62170,62207,Campigneulles-les-Petites,62,,,622070000A0299,,,,,,,,,,,,,0,1,Maison,92,5,S,sols,,,415,1.748322,50.451741
2019-929306,2019-07-23,000001,Vente,1100000,5003,,PARC D'ACTIVITES,X010,62170,62207,Campigneulles-les-Petites,62,,,62207000ZB0066,,,,,,,,,,,,,0,4,Local industriel. commercial ou assimilé,1515,0,S,sols,,,3352,1.747986,50.450466
2019-929306,2019-07-23,000001,Vente,1100000,,,LE CORTYL LORMEAU,B011,62170,62207,Campigneulles-les-Petites,62,,,62207000ZB0077,,,,,,,,,,,,,0,,,,,AB,terrains a bâtir,,,336,1.747488,50.450409
2019-929375,2019-08-05,000001,Vente,235000,35,,RUE DU PIZET,0234,62170,62207,Campigneulles-les-Petites,62,,,62207000ZB0059,,,,,,,,,,,,,0,1,Maison,173,5,J,jardins,,,442,1.74322,50.442605
2019-929375,2019-08-05,000001,Vente,235000,35,,RUE DU PIZET,0234,62170,62207,Campigneulles-les-Petites,62,,,62207000ZB0059,,,,,,,,,,,,,0,1,Maison,173,5,S,sols,,,1000,1.74322,50.442605
2019-929938,2019-09-14,000001,Vente,315000,3,,RUE DE PARIS,0226,62170,62207,Campigneulles-les-Petites,62,,,622070000A0335,,,,,,,,,,,,,0,1,Maison,140,5,T,terres,,,1702,1.752179,50.451827
2019-930963,2019-12-13,000001,Vente,3.6,5008,,PARC D'ACTIVITES,X010,62170,62207,Campigneulles-les-Petites,62,,,62207000ZB0081,,,,,,,,,,,,,0,4,Local industriel. commercial ou assimilé,4220,0,S,sols,,,7536,1.747934,50.44934
2019-930963,2019-12-13,000001,Vente,3.6,5008,,PARC D'ACTIVITES,X010,62170,62207,Campigneulles-les-Petites,62,,,62207000ZB0081,,,,,,,,,,,,,0,4,Local industriel. commercial ou assimilé,120,0,S,sols,,,7536,1.747934,50.44934
2019-930963,2019-12-13,000001,Vente,3.6,5008,,PARC D'ACTIVITES,X010,62170,62207,Campigneulles-les-Petites,62,,,62207000ZB0081,,,,,,,,,,,,,0,4,Local industriel. commercial ou assimilé,450,0,S,sols,,,7536,1.747934,50.44934
