id_mutation,date_mutation,numero_disposition,nature_mutation,valeur_fonciere,adresse_numero,adresse_suffixe,adresse_nom_voie,adresse_code_voie,code_postal,code_commune,nom_commune,code_departement,ancien_code_commune,ancien_nom_commune,id_parcelle,ancien_id_parcelle,numero_volume,lot1_numero,lot1_surface_carrez,lot2_numero,lot2_surface_carrez,lot3_numero,lot3_surface_carrez,lot4_numero,lot4_surface_carrez,lot5_numero,lot5_surface_carrez,nombre_lots,code_type_local,type_local,surface_reelle_bati,nombre_pieces_principales,code_nature_culture,nature_culture,code_nature_culture_speciale,nature_culture_speciale,surface_terrain,longitude,latitude
2019-923360,2019-03-28,000001,Vente,320000,344,,RTE DE VERLINCTHUN,0011,62830,62214,Carly,62,,,62214000AK0181,,,,,,,,,,,,,0,1,Maison,197,4,S,sols,,,250,1.701497,50.647381
2019-923360,2019-03-28,000001,Vente,320000,344,,RTE DE VERLINCTHUN,0011,62830,62214,Carly,62,,,62214000AK0181,,,,,,,,,,,,,0,1,Maison,197,4,AG,terrains d'agrément,,,3628,1.701497,50.647381
2019-923515,2019-04-26,000001,Vente,8000,370,,IMP DU CHATEAU DU HOURET,0010,62830,62214,Carly,62,,,62214000AI0064,,,,,,,,,,,,,0,1,Maison,25,1,S,sols,,,755,1.716705,50.651512
2019-923515,2019-04-26,000001,Vente,8000,370,,IMP DU CHATEAU DU HOURET,0010,62830,62214,Carly,62,,,62214000AI0064,,,,,,,,,,,,,0,1,Maison,25,1,AG,terrains d'agrément,,,3267,1.716705,50.651512
2019-923812,2019-05-17,000001,Vente,105000,,,LES COMMUNES,B012,62830,62214,Carly,62,,,62214000AC0153,,,,,,,,,,,,,0,,,,,J,jardins,,,1307,1.696266,50.64665
2019-923812,2019-05-17,000001,Vente,105000,508,,IMP DES COMMUNES,0013,62830,62214,Carly,62,,,62214000AC0225,,,,,,,,,,,,,0,1,Maison,47,2,S,sols,,,830,1.696165,50.646403
2019-924809,2019-07-25,000001,Vente,175000,771,,LE HOURQUET,B024,62830,62214,Carly,62,,,62214000AH0053,,,,,,,,,,,,,0,1,Maison,123,4,S,sols,,,701,1.721467,50.658655
2019-924809,2019-07-25,000001,Vente,175000,,,LE HOURQUET,B024,62830,62214,Carly,62,,,62214000AH0085,,,,,,,,,,,,,0,,,,,AG,terrains d'agrément,,,1004,1.721736,50.658559
2019-924829,2019-07-02,000003,Vente,75000,,,LES PLACES,B034,62830,62214,Carly,62,,,62214000AC0300,,,,,,,,,,,,,0,,,,,P,prés,,,1550,1.711479,50.65228
2019-924829,2019-07-02,000003,Vente,75000,,,LES PLACES,B034,62830,62214,Carly,62,,,62214000AC0307,,,,,,,,,,,,,0,,,,,P,prés,,,65,1.711677,50.652033
2019-924901,2019-07-30,000001,Vente,320000,1594,,RTE D HESDIGNEUL,0017,62830,62214,Carly,62,,,62214000AC0263,,,,,,,,,,,,,0,1,Maison,127,4,AB,terrains a bâtir,,,1438,1.69714,50.653673
2019-925501,2019-09-12,000001,Vente,135000,2279,,RTE NATIONALE NO 1,0055,62830,62214,Carly,62,,,62214000AI0032,,,,,,,,,,,,,0,1,Maison,163,4,S,sols,,,750,1.730419,50.651634
2019-925501,2019-09-12,000001,Vente,135000,,,MAISON L HOMME,B028,62830,62214,Carly,62,,,62214000AI0033,,,,,,,,,,,,,0,,,,,J,jardins,,,752,1.72997,50.651807
2019-925501,2019-09-12,000001,Vente,135000,,,MAISON L HOMME,B028,62830,62214,Carly,62,,,62214000AI0034,,,,,,,,,,,,,0,,,,,P,prés,,,1659,1.729692,50.65203
2019-925501,2019-09-12,000001,Vente,135000,,,MAISON L HOMME,B028,62830,62214,Carly,62,,,62214000AI0035,,,,,,,,,,,,,0,,,,,P,prés,,,1242,1.729412,50.652309
2019-925501,2019-09-12,000001,Vente,135000,,,MAISON L HOMME,B028,62830,62214,Carly,62,,,62214000AI0036,,,,,,,,,,,,,0,,,,,P,prés,,,2688,1.728842,50.652743
2019-925938,2019-10-14,000001,Vente,200000,1101,,LE VILLAGE,B042,62830,62214,Carly,62,,,62214000AB0078,,,,,,,,,,,,,0,1,Maison,95,4,S,sols,,,1443,1.701858,50.651188
2019-925938,2019-10-14,000001,Vente,200000,1101,,LE VILLAGE,B042,62830,62214,Carly,62,,,62214000AB0078,,,,,,,,,,,,,0,1,Maison,95,4,AG,terrains d'agrément,,,1250,1.701858,50.651188
2019-926067,2019-10-11,000001,Vente,140000,,,FOURCHE DU CHAMP DELANNOY,B022,62830,62214,Carly,62,,,62214000AK0123,,,,,,,,,,,,,0,,,,,J,jardins,,,968,1.699117,50.648081
2019-926067,2019-10-11,000001,Vente,140000,241,,IMP DES COMMUNES,0013,62830,62214,Carly,62,,,62214000AK0124,,,,,,,,,,,,,0,1,Maison,83,3,S,sols,,,625,1.699324,50.648259
2019-926128,2019-10-17,000001,Vente,295000,195,,RTE DE VERLINCTHUN,0011,62830,62214,Carly,62,,,62214000AK0158,,,,,,,,,,,,,0,1,Maison,127,7,AB,terrains a bâtir,,,1200,1.702103,50.648572
2019-926128,2019-10-17,000001,Vente,295000,,,CONTERIE,B013,62830,62214,Carly,62,,,62214000AK0176,,,,,,,,,,,,,0,,,,,AG,terrains d'agrément,,,475,1.702467,50.648419
