id_mutation,date_mutation,numero_disposition,nature_mutation,valeur_fonciere,adresse_numero,adresse_suffixe,adresse_nom_voie,adresse_code_voie,code_postal,code_commune,nom_commune,code_departement,ancien_code_commune,ancien_nom_commune,id_parcelle,ancien_id_parcelle,numero_volume,lot1_numero,lot1_surface_carrez,lot2_numero,lot2_surface_carrez,lot3_numero,lot3_surface_carrez,lot4_numero,lot4_surface_carrez,lot5_numero,lot5_surface_carrez,nombre_lots,code_type_local,type_local,surface_reelle_bati,nombre_pieces_principales,code_nature_culture,nature_culture,code_nature_culture_speciale,nature_culture_speciale,surface_terrain,longitude,latitude
2019-927471,2019-01-17,000001,Vente,2700,,,LE VILLAGE,B063,62140,62220,Cavron-Saint-Martin,62,,,622200000D0963,,,,,,,,,,,,,0,,,,,P,prés,,,2012,1.991098,50.415428
2019-927524,2019-02-04,000001,Vente,2325,,,LE VILLAGE,B063,62140,62220,Cavron-Saint-Martin,62,,,622200000C0835,,,,,,,,,,,,,0,,,,,P,prés,,,1933,2.009099,50.417752
2019-927524,2019-02-04,000001,Vente,2325,,,LE VILLAGE,B063,62140,62220,Cavron-Saint-Martin,62,,,622200000C0836,,,,,,,,,,,,,0,,,,,J,jardins,,,1167,2.009827,50.418053
2019-927792,2019-02-16,000001,Vente,45000,66,,RUE PRINCIPALE,0351,62140,62220,Cavron-Saint-Martin,62,,,622200000C0041,,,,,,,,,,,,,0,1,Maison,101,3,S,sols,,,1155,,
2019-927792,2019-02-16,000001,Vente,45000,66,,RUE PRINCIPALE,0351,62140,62220,Cavron-Saint-Martin,62,,,622200000C0041,,,,,,,,,,,,,0,1,Maison,50,2,S,sols,,,1155,,
2019-927792,2019-02-16,000001,Vente,45000,,,LE VILLAGE,B063,62140,62220,Cavron-Saint-Martin,62,,,622200000C0931,,,,,,,,,,,,,0,,,,,J,jardins,,,896,2.00234,50.416513
2019-927792,2019-02-16,000001,Vente,45000,,,LE VILLAGE,B063,62140,62220,Cavron-Saint-Martin,62,,,622200000C0943,,,,,,,,,,,,,0,,,,,P,prés,,,139,2.002316,50.416295
2019-927829,2019-03-07,000001,Vente,9510.8,,,LE BOIS DU BIEZ,B004,62140,62220,Cavron-Saint-Martin,62,,,62220000ZO0013,,,,,,,,,,,,,0,,,,,T,terres,,,10747,1.989583,50.43851
2019-927829,2019-03-07,000001,Vente,9510.8,,,LE BOIS DU BIEZ,B004,62140,62220,Cavron-Saint-Martin,62,,,62220000ZO0013,,,,,,,,,,,,,0,,,,,T,terres,,,5373,1.989583,50.43851
2019-927853,2019-02-27,000001,Vente,123000,3,,RUE DU CHATEAU,0060,62140,62220,Cavron-Saint-Martin,62,,,622200000B0399,,,,,,,,,,,,,0,1,Maison,104,6,S,sols,,,395,2.013234,50.423578
2019-927853,2019-02-27,000001,Vente,123000,,,LE VILLAGE,B063,62140,62220,Cavron-Saint-Martin,62,,,622200000B0401,,,,,,,,,,,,,0,,,,,S,sols,,,105,2.01314,50.423617
2019-927853,2019-02-27,000001,Vente,123000,,,LE VILLAGE,B063,62140,62220,Cavron-Saint-Martin,62,,,622200000B0416,,,,,,,,,,,,,0,,,,,J,jardins,,,3582,2.012519,50.423796
2019-927992,2019-03-21,000001,Vente,1000,,,LE VILLAGE,B063,62140,62220,Cavron-Saint-Martin,62,,,622200000B0076,,,,,,,,,,,,,0,,,,,BS,taillis sous futaie,,,1385,2.015119,50.424913
2019-928002,2019-02-27,000001,Vente,83000,16,,RUE DU PETIT MARAIS,0342,62140,62220,Cavron-Saint-Martin,62,,,622200000B0397,,,,,,,,,,,,,0,1,Maison,100,3,S,sols,,,508,2.008263,50.42078
2019-928002,2019-02-27,000001,Vente,83000,,,LE VILLAGE,B063,62140,62220,Cavron-Saint-Martin,62,,,622200000B0455,,,,,,,,,,,,,0,,,,,P,prés,,,368,2.00817,50.42087
2019-928096,2019-03-19,000001,Vente,110000,1,,RUE DU MARAIS,0240,62140,62220,Cavron-Saint-Martin,62,,,622200000D1001,,,,,,,,,,,,,0,1,Maison,77,3,S,sols,,,1250,1.987783,50.415843
2019-928096,2019-03-19,000001,Vente,110000,,,LE VILLAGE,B063,62140,62220,Cavron-Saint-Martin,62,,,622200000D1006,,,,,,,,,,,,,0,,,,,S,sols,,,14,1.987842,50.41598
2019-928906,2019-07-04,000002,Vente,620,,,LE VILLAGE,B063,62140,62220,Cavron-Saint-Martin,62,,,622200000B0566,,,,,,,,,,,,,0,,,,,P,prés,,,9,2.01331,50.422699
2019-928906,2019-07-04,000002,Vente,620,,,LE VILLAGE,B063,62140,62220,Cavron-Saint-Martin,62,,,622200000B0567,,,,,,,,,,,,,0,,,,,P,prés,,,4,2.013341,50.422875
2019-928906,2019-07-04,000002,Vente,620,,,LE VILLAGE,B063,62140,62220,Cavron-Saint-Martin,62,,,622200000B0569,,,,,,,,,,,,,0,,,,,S,sols,,,18,2.013378,50.422806
2019-929224,2019-07-23,000001,Vente,46000,,,LE VILLAGE,B063,62140,62220,Cavron-Saint-Martin,62,,,622200000B0489,,,,,,,,,,,,,0,,,,,S,sols,,,144,2.006844,50.420069
2019-929224,2019-07-23,000001,Vente,46000,26,,RUE DU PETIT MARAIS,0342,62140,62220,Cavron-Saint-Martin,62,,,622200000B0491,,,,,,,,,,,,,0,1,Maison,70,3,S,sols,,,33,2.006884,50.420049
2019-930090,2019-10-01,000001,Vente,35500,,,LE VILLAGE,B063,62140,62220,Cavron-Saint-Martin,62,,,622200000B0172,,,,,,,,,,,,,0,,,,,P,prés,,,5890,2.002898,50.417721
2019-930215,2019-10-08,000001,Vente,165500,,,LE PATIS A CAILLOUX,B042,62140,62220,Cavron-Saint-Martin,62,,,62220000ZD0033,,,,,,,,,,,,,0,,,,,T,terres,,,14940,2.021241,50.417501
2019-930215,2019-10-08,000001,Vente,165500,,,LA PLAINE DE LA LOGE,B049,62140,62220,Cavron-Saint-Martin,62,,,62220000ZE0025,,,,,,,,,,,,,0,,,,,T,terres,,,51980,2.023736,50.415021
2019-930278,2019-10-12,000001,Vente,131000,49,,RUE PRINCIPALE,0351,62140,62220,Cavron-Saint-Martin,62,,,622200000D0539,,,,,,,,,,,,,0,1,Maison,110,4,S,sols,,,240,1.998433,50.415816
2019-930278,2019-10-12,000001,Vente,131000,,,LE VILLAGE,B063,62140,62220,Cavron-Saint-Martin,62,,,622200000D0540,,,,,,,,,,,,,0,,,,,J,jardins,,,880,1.99847,50.415907
2019-930362,2019-10-18,000001,Vente,130000,36,,RUE DE LA CHAPELLE,0058,62140,62220,Cavron-Saint-Martin,62,,,622200000C0822,,,,,,,,,,,,,0,4,Local industriel. commercial ou assimilé,75,0,S,sols,,,795,1.999027,50.414224
2019-930362,2019-10-18,000001,Vente,130000,36,,RUE DE LA CHAPELLE,0058,62140,62220,Cavron-Saint-Martin,62,,,622200000C0822,,,,,,,,,,,,,0,1,Maison,153,5,AG,terrains d'agrément,,,705,1.999027,50.414224
2019-930362,2019-10-18,000001,Vente,130000,36,,RUE DE LA CHAPELLE,0058,62140,62220,Cavron-Saint-Martin,62,,,622200000C0822,,,,,,,,,,,,,0,4,Local industriel. commercial ou assimilé,75,0,AG,terrains d'agrément,,,705,1.999027,50.414224
2019-930362,2019-10-18,000001,Vente,130000,36,,RUE DE LA CHAPELLE,0058,62140,62220,Cavron-Saint-Martin,62,,,622200000C0822,,,,,,,,,,,,,0,1,Maison,153,5,S,sols,,,795,1.999027,50.414224
2019-930552,2019-10-30,000001,Vente,109600,,,LE PATIS A CAILLOUX,B042,62140,62220,Cavron-Saint-Martin,62,,,62220000ZD0033,,,,,,,,,,,,,0,,,,,T,terres,,,14940,2.021241,50.417501
2019-930552,2019-10-30,000001,Vente,109600,,,LA PLAINE DE LA LOGE,B049,62140,62220,Cavron-Saint-Martin,62,,,62220000ZE0025,,,,,,,,,,,,,0,,,,,T,terres,,,51980,2.023736,50.415021
2019-930642,2019-11-15,000001,Vente,165000,4,,RUE DU STADE,0375,62140,62220,Cavron-Saint-Martin,62,,,622200000D1057,,,,,,,,,,,,,0,1,Maison,118,4,J,jardins,,,1105,1.992863,50.413423
2019-930642,2019-11-15,000001,Vente,165000,4,,RUE DU STADE,0375,62140,62220,Cavron-Saint-Martin,62,,,622200000D1057,,,,,,,,,,,,,0,1,Maison,118,4,S,sols,,,1000,1.992863,50.413423
2019-931014,2019-12-20,000001,Vente,131000,,,LE VILLAGE,B063,62140,62220,Cavron-Saint-Martin,62,,,622200000D0702,,,,,,,,,,,,,0,,,,,P,prés,,,2369,1.987462,50.414717
2019-931014,2019-12-20,000001,Vente,131000,12,,RUE DU MARAIS,0240,62140,62220,Cavron-Saint-Martin,62,,,622200000D1023,,,,,,,,,,,,,0,1,Maison,123,5,AG,terrains d'agrément,,,1680,1.98757,50.415075
2019-931014,2019-12-20,000001,Vente,131000,12,,RUE DU MARAIS,0240,62140,62220,Cavron-Saint-Martin,62,,,622200000D1023,,,,,,,,,,,,,0,1,Maison,123,5,S,sols,,,215,1.98757,50.415075
