id_mutation,date_mutation,numero_disposition,nature_mutation,valeur_fonciere,adresse_numero,adresse_suffixe,adresse_nom_voie,adresse_code_voie,code_postal,code_commune,nom_commune,code_departement,ancien_code_commune,ancien_nom_commune,id_parcelle,ancien_id_parcelle,numero_volume,lot1_numero,lot1_surface_carrez,lot2_numero,lot2_surface_carrez,lot3_numero,lot3_surface_carrez,lot4_numero,lot4_surface_carrez,lot5_numero,lot5_surface_carrez,nombre_lots,code_type_local,type_local,surface_reelle_bati,nombre_pieces_principales,code_nature_culture,nature_culture,code_nature_culture_speciale,nature_culture_speciale,surface_terrain,longitude,latitude
2019-927316,2019-01-05,000001,Vente,118300,908,,RES LE BRITANIA RUE DE LILLE,A004,62780,62261,Cucq,62,,,62261000BL0168,,,203,,,,,,,,,,1,2,Appartement,36,2,,,,,,1.586034,50.480235
2019-927316,2019-01-05,000001,Vente,118300,888,,RES LE BRITANIA RUE DE LILLE,A004,62780,62261,Cucq,62,,,62261000BL0168,,,66,,,,,,,,,,1,3,Dépendance,,0,,,,,,1.586034,50.480235
2019-927316,2019-01-05,000001,Vente,118300,908,,RES LE BRITANIA RUE DE LILLE,A004,62780,62261,Cucq,62,,,62261000BL0168,,,208,,,,,,,,,,1,3,Dépendance,,0,,,,,,1.586034,50.480235
2019-927336,2019-01-16,000001,Vente,212000,,,LE BOUT DE HAUT,B007,62780,62261,Cucq,62,,,62261000AY0091,,,,,,,,,,,,,0,,,,,S,sols,,,143,1.617905,50.474355
2019-927336,2019-01-16,000001,Vente,212000,,,LE BOUT DE HAUT,B007,62780,62261,Cucq,62,,,62261000AY0091,,,,,,,,,,,,,0,,,,,AG,terrains d'agrément,,,1311,1.617905,50.474355
2019-927336,2019-01-16,000001,Vente,212000,69,,AV DE LA LIBERATION,0750,62780,62261,Cucq,62,,,62261000AY0155,,,,,,,,,,,,,0,4,Local industriel. commercial ou assimilé,32,0,S,sols,,,428,1.617933,50.474248
2019-927336,2019-01-16,000001,Vente,212000,69,,AV DE LA LIBERATION,0750,62780,62261,Cucq,62,,,62261000AY0155,,,,,,,,,,,,,0,1,Maison,150,5,S,sols,,,428,1.617933,50.474248
2019-927348,2019-01-05,000001,Vente,422950,119,,RUE DES IRIS,0640,62780,62261,Cucq,62,,,62261000AY0204,,,,,,,,,,,,,0,1,Maison,105,3,S,sols,,,1000,1.616555,50.478158
2019-927355,2019-01-22,000001,Vente,100000,214,,RUE ALBERT,0030,62780,62261,Cucq,62,,,62261000BL0468,,,,,,,,,,,,,0,1,Maison,31,2,S,sols,,,245,1.58941,50.483388
2019-927356,2019-01-18,000001,Vente,125000,31,,AV DU TOUQUET,1270,62780,62261,Cucq,62,,,62261000BC0251,,,,,,,,,,,,,0,1,Maison,42,3,S,sols,,,53,1.603949,50.483277
2019-927368,2019-01-24,000001,Vente,478000,255,,ALL DES CHENES,0265,62780,62261,Cucq,62,,,62261000AM0320,,,,,,,,,,,,,0,1,Maison,130,4,S,sols,,,373,1.612541,50.490538
2019-927368,2019-01-24,000001,Vente,478000,255,,ALL DES CHENES,0265,62780,62261,Cucq,62,,,62261000AM0320,,,,,,,,,,,,,0,1,Maison,130,4,J,jardins,MARAI,Pré marais,1597,1.612541,50.490538
2019-927372,2019-01-24,000001,Vente,95500,40,,RES LA FEUILLERAIE -ALL ALSACE,A017,62780,62261,Cucq,62,,,62261000BE0084,,,24,,,,,,,,,,1,2,Appartement,24,2,,,,,,1.597501,50.479439
2019-927372,2019-01-24,000001,Vente,95500,40,,RES LA FEUILLERAIE -ALL ALSACE,A017,62780,62261,Cucq,62,,,62261000BE0084,,,63,,,,,,,,,,1,3,Dépendance,,0,,,,,,1.597501,50.479439
2019-927372,2019-01-24,000001,Vente,95500,40,,RES LA FEUILLERAIE -ALL ALSACE,A017,62780,62261,Cucq,62,,,62261000BE0084,,,51,,,,,,,,,,1,3,Dépendance,,0,,,,,,1.597501,50.479439
2019-927382,2019-01-18,000001,Vente,335000,827,,AV DE LA CONCORDE,0320,62780,62261,Cucq,62,,,62261000BH0102,,,,,,,,,,,,,0,1,Maison,70,3,S,sols,,,412,1.591638,50.480494
2019-927382,2019-01-18,000001,Vente,335000,,,LE GOLF,B034,62780,62261,Cucq,62,,,62261000BH0105,,,,,,,,,,,,,0,,,,,S,sols,,,98,1.591919,50.480488
2019-927386,2019-01-23,000001,Vente,129000,40,,RES LA FEUILLERAIE -ALL ALSACE,A017,62780,62261,Cucq,62,,,62261000BE0084,,,26,,,,,,,,,,1,2,Appartement,35,2,,,,,,1.597501,50.479439
2019-927386,2019-01-23,000001,Vente,129000,40,,RES LA FEUILLERAIE -ALL ALSACE,A017,62780,62261,Cucq,62,,,62261000BE0084,,,53,,,,,,,,,,1,3,Dépendance,,0,,,,,,1.597501,50.479439
2019-927386,2019-01-23,000001,Vente,129000,40,,RES LA FEUILLERAIE -ALL ALSACE,A017,62780,62261,Cucq,62,,,62261000BE0084,,,68,,,,,,,,,,1,3,Dépendance,,0,,,,,,1.597501,50.479439
2019-927388,2019-01-21,000001,Vente,168000,221,,AV DE LA VICTOIRE,1310,62780,62261,Cucq,62,,,62261000BH0546,,,,,,,,,,,,,0,1,Maison,56,3,S,sols,,,283,1.59403,50.483758
2019-927391,2019-01-05,000001,Vente,120000,65,,RUE DE LA CANCHE,0220,62780,62261,Cucq,62,,,62261000AB0117,,,,,,,,,,,,,0,1,Maison,66,4,S,sols,,,887,1.626449,50.508713
2019-927399,2019-01-05,000001,Vente,60000,,,LA PLAINE NONOTTE,B059,62780,62261,Cucq,62,,,62261000BC0165,,,,,,,,,,,,,0,,,,,AB,terrains a bâtir,,,394,1.604796,50.481027
2019-927399,2019-01-05,000001,Vente,60000,,,LA PLAINE NONOTTE,B059,62780,62261,Cucq,62,,,62261000BC0166,,,,,,,,,,,,,0,,,,,AB,terrains a bâtir,,,310,1.604887,50.480978
2019-927403,2019-01-25,000001,Vente,90000,448,,RUE D AMIENS,0050,62780,62261,Cucq,62,,,62261000BK0546,,,3,,,,,,,,,,1,2,Appartement,38,3,,,,,,1.587886,50.478251
2019-927406,2019-01-25,000001,Vente,134000,1064,,BD D ANGLETERRE,0070,62780,62261,Cucq,62,,,62261000BK0484,,,1,,8,,,,,,,,2,2,Appartement,50,3,,,,,,1.586891,50.477071
2019-927414,2019-01-12,000001,Vente,220000,251,,AV DU TOUQUET,1270,62780,62261,Cucq,62,,,62261000BE0300,,,,,,,,,,,,,0,1,Maison,38,2,S,sols,,,129,1.601376,50.484103
2019-927414,2019-01-12,000001,Vente,220000,,,LES PELOUSES AV DE VERDUN,B055,62780,62261,Cucq,62,,,62261000BE0301,,,,,,,,,,,,,0,,,,,BT,taillis simples,,,1271,1.601484,50.483984
2019-927434,2019-01-26,000001,Vente,19500,952,,RES SUNNY BEACH,A052,62780,62261,Cucq,62,,,62261000BM0034,,,45,,,,,,,,,,1,3,Dépendance,,0,,,,,,1.576334,50.481613
2019-927435,2019-01-30,000001,Vente,150000,92,,RUE DE LA CANCHE,0220,62780,62261,Cucq,62,,,62261000AC0368,,,,,,,,,,,,,0,2,Appartement,108,5,S,sols,,,250,,
2019-927435,2019-01-30,000001,Vente,150000,92,,RUE DE LA CANCHE,0220,62780,62261,Cucq,62,,,62261000AC0368,,,,,,,,,,,,,0,4,Local industriel. commercial ou assimilé,39,0,S,sols,,,250,,
2019-927448,2019-02-04,000001,Vente,336000,104,,AV DU TOUQUET,1270,62780,62261,Cucq,62,,,62261000BC0001,,,,,,,,,,,,,0,1,Maison,110,4,S,sols,,,552,1.603411,50.483945
2019-927478,2019-02-01,000001,Vente,162000,264,,RUE DU LAC,0730,62780,62261,Cucq,62,,,62261000BI0546,,,,,,,,,,,,,0,1,Maison,56,3,S,sols,,,738,1.596424,50.476513
2019-927490,2019-01-25,000001,Vente,146000,976,,RES SUNNY BEACH,A052,62780,62261,Cucq,62,,,62261000BM0034,,,323,,,,,,,,,,1,3,Dépendance,,0,,,,,,1.576334,50.481613
2019-927490,2019-01-25,000001,Vente,146000,976,,RES SUNNY BEACH,A052,62780,62261,Cucq,62,,,62261000BM0034,,,299,,,,,,,,,,1,3,Dépendance,,0,,,,,,1.576334,50.481613
2019-927490,2019-01-25,000001,Vente,146000,976,,RES SUNNY BEACH,A052,62780,62261,Cucq,62,,,62261000BM0034,,,211,,,,,,,,,,1,2,Appartement,35,2,,,,,,1.576334,50.481613
2019-927491,2019-02-05,000001,Vente,449000,498,,AV DU CHATEAU D EAU,0256,62780,62261,Cucq,62,,,62261000BC0039,,,,,,,,,,,,,0,1,Maison,141,5,L,landes,,,577,1.605979,50.481811
2019-927491,2019-02-05,000001,Vente,449000,498,,AV DU CHATEAU D EAU,0256,62780,62261,Cucq,62,,,62261000BC0039,,,,,,,,,,,,,0,1,Maison,141,5,S,sols,,,311,1.605979,50.481811
2019-927491,2019-02-05,000001,Vente,449000,498,,AV DU CHATEAU D EAU,0256,62780,62261,Cucq,62,,,62261000BC0039,,,,,,,,,,,,,0,1,Maison,141,5,AG,terrains d'agrément,,,799,1.605979,50.481811
2019-927491,2019-02-05,000001,Vente,449000,498,,AV DU CHATEAU D EAU,0256,62780,62261,Cucq,62,,,62261000BC0039,,,,,,,,,,,,,0,1,Maison,141,5,L,landes,,,178,1.605979,50.481811
2019-927500,2019-01-08,000001,Vente,160000,1599,,RES SUMMERTIME BD E. LABRASSE,A051,62780,62261,Cucq,62,,,62261000BL0167,,,24,,,,,,,,,,1,3,Dépendance,,0,,,,,,1.585978,50.480566
2019-927500,2019-01-08,000001,Vente,160000,1599,,RES SUMMERTIME BD E. LABRASSE,A051,62780,62261,Cucq,62,,,62261000BL0167,,,56,,,,,,,,,,1,2,Appartement,41,3,,,,,,1.585978,50.480566
2019-927503,2019-02-08,000001,Vente,155000,647,,BD D ANGLETERRE,0070,62780,62261,Cucq,62,,,62261000BI0097,,,,,,,,,,,,,0,1,Maison,50,3,S,sols,,,500,1.59179,50.475152
2019-927521,2019-01-29,000001,Vente,230000,137,,ALL DES WASSINES,1360,62780,62261,Cucq,62,,,62261000AS0125,,,,,,,,,,,,,0,1,Maison,144,5,S,sols,,,688,1.628788,50.48354
2019-927533,2019-02-01,000001,Vente,210000,79,,RUE DE SAINT QUENTIN,1180,62780,62261,Cucq,62,,,62261000BH0633,,,,,,,,,,,,,0,1,Maison,50,3,S,sols,,,200,1.594945,50.483503
2019-927542,2019-02-09,000001,Vente,354000,49,,AV DE PARIS,1020,62780,62261,Cucq,62,,,62261000BN0732,,,,,,,,,,,,,0,1,Maison,107,5,S,sols,,,93,1.576478,50.477278
2019-927542,2019-02-09,000001,Vente,354000,,,LA PLAGE SUD,B058,62780,62261,Cucq,62,,,62261000BN0734,,,,,,,,,,,,,0,,,,,L,landes,,,399,1.576303,50.477291
2019-927556,2019-02-07,000001,Vente,58000,142,,RUE DES TETU,1250,62780,62261,Cucq,62,,,62261000AH0379,,,1,,,,,,,,,,1,2,Appartement,41,3,,,,,,1.628216,50.500115
2019-927562,2019-02-15,000001,Vente,15500,1640,,BD EDMOND LABRASSE,0410,62780,62261,Cucq,62,,,62261000BL0151,,,17,,,,,,,,,,1,3,Dépendance,,0,,,,,,1.585447,50.480953
2019-927563,2019-01-25,000001,Vente,231000,928,,RES SUNNY BEACH,A052,62780,62261,Cucq,62,,,62261000BM0034,,,423,,,,,,,,,,1,2,Appartement,48,2,,,,,,1.576334,50.481613
2019-927563,2019-01-25,000001,Vente,231000,928,,RES SUNNY BEACH,A052,62780,62261,Cucq,62,,,62261000BM0034,,,451,,,,,,,,,,1,3,Dépendance,,0,,,,,,1.576334,50.481613
2019-927563,2019-01-25,000001,Vente,231000,928,,RES SUNNY BEACH,A052,62780,62261,Cucq,62,,,62261000BM0034,,,452,,,,,,,,,,1,3,Dépendance,,0,,,,,,1.576334,50.481613
2019-927563,2019-01-25,000001,Vente,231000,928,,RES SUNNY BEACH,A052,62780,62261,Cucq,62,,,62261000BM0034,,,467,,,,,,,,,,1,3,Dépendance,,0,,,,,,1.576334,50.481613
2019-927565,2019-02-14,000001,Vente,120000,141,,ALL DES PRIMEVERES,1130,62780,62261,Cucq,62,,,62261000AS0120,,,,,,,,,,,,,0,1,Maison,92,5,S,sols,,,640,1.629286,50.483844
2019-927603,2019-02-15,000002,Vente,1390,,,LES CROCS BERGEMOND,B028,62780,62261,Cucq,62,,,62261000AL0375,,,,,,,,,,,,,0,,,,,BT,taillis simples,,,46,1.631736,50.499875
2019-927610,2019-02-19,000001,Vente,235000,283,,BD D ANGLETERRE,0070,62780,62261,Cucq,62,,,62261000BI0732,,,,,,,,,,,,,0,1,Maison,80,4,S,sols,,,493,1.596181,50.473564
2019-927610,2019-02-19,000001,Vente,235000,,,LE BOIS JOLI,B006,62780,62261,Cucq,62,,,62261000BI1120,,,,,,,,,,,,,0,,,,,AG,terrains d'agrément,,,316,1.596285,50.473672
2019-927610,2019-02-19,000001,Vente,235000,,,LE BOIS JOLI,B006,62780,62261,Cucq,62,,,62261000BI1122,,,,,,,,,,,,,0,,,,,AB,terrains a bâtir,,,50,1.596624,50.473814
2019-927616,2019-01-25,000001,Vente,252000,,,LE BAILLARQUET,B002,62780,62261,Cucq,62,,,62261000AZ0081,,,,,,,,,,,,,0,,,,,L,landes,,,2769,1.606342,50.480647
2019-927616,2019-01-25,000001,Vente,252000,242,,RUE DU BAILLARQUET,0110,62780,62261,Cucq,62,,,62261000AZ0186,,,,,,,,,,,,,0,1,Maison,114,6,S,sols,,,2733,1.607355,50.480838
2019-927616,2019-01-25,000001,Vente,252000,242,,RUE DU BAILLARQUET,0110,62780,62261,Cucq,62,,,62261000AZ0186,,,,,,,,,,,,,0,4,Local industriel. commercial ou assimilé,121,0,S,sols,,,2733,1.607355,50.480838
2019-927618,2019-01-31,000001,Vente,290000,35,,RUE DU NORD,0990,62780,62261,Cucq,62,,,62261000BD0400,,,,,,,,,,,,,0,1,Maison,110,4,S,sols,,,264,1.599806,50.474643
2019-927618,2019-01-31,000001,Vente,290000,,,LA GRANDE DUNE,B036,62780,62261,Cucq,62,,,62261000BD0401,,,,,,,,,,,,,0,,,,,AB,terrains a bâtir,,,75,1.599862,50.474771
2019-927638,2019-02-21,000001,Vente,210000,168,,RUE DES PINS,1080,62780,62261,Cucq,62,,,62261000BH0992,,,2,,,,,,,,,,1,1,Maison,53,3,,,,,,,
2019-927666,2019-02-01,000001,Vente,210000,515,,RUE DES CERTAINS,0240,62780,62261,Cucq,62,,,62261000AY0007,,,,,,,,,,,,,0,1,Maison,93,4,S,sols,,,365,1.611518,50.473576
2019-927666,2019-02-01,000001,Vente,210000,515,,RUE DES CERTAINS,0240,62780,62261,Cucq,62,,,62261000AY0007,,,,,,,,,,,,,0,3,Dépendance,,0,S,sols,,,365,1.611518,50.473576
2019-927666,2019-02-01,000001,Vente,210000,,,LE BOUT DES CERTAINS,B008,62780,62261,Cucq,62,,,62261000AY0163,,,,,,,,,,,,,0,,,,,P,prés,,,307,1.611185,50.473362
2019-927666,2019-02-01,000001,Vente,210000,,,LE BOUT DES CERTAINS,B008,62780,62261,Cucq,62,,,62261000AY0165,,,,,,,,,,,,,0,,,,,J,jardins,POTAG,Jardin potager,485,1.611422,50.473538
2019-927676,2019-02-04,000001,Vente,330000,,,LE GOLF,B034,62780,62261,Cucq,62,,,62261000BH0795,,,,,,,,,,,,,0,,,,,AB,terrains a bâtir,,,116,1.59304,50.481004
2019-927676,2019-02-04,000001,Vente,330000,105,,AV DU GENERAL GALLIENI,0580,62780,62261,Cucq,62,,,62261000BH0796,,,,,,,,,,,,,0,1,Maison,101,5,S,sols,,,600,1.592671,50.480962
2019-927679,2019-02-23,000001,Vente,155000,,,LE BOIS JOLI,B006,62780,62261,Cucq,62,,,62261000BI0275,,,,,,,,,,,,,0,,,,,AB,terrains a bâtir,,,54,1.590515,50.477322
2019-927679,2019-02-23,000001,Vente,155000,237,,RUE D AMIENS,0050,62780,62261,Cucq,62,,,62261000BI0276,,,,,,,,,,,,,0,1,Maison,60,3,S,sols,,,288,1.590447,50.477128
2019-927700,2019-02-12,000001,Vente,380000,1024,,RES SUNNY BEACH,A052,62780,62261,Cucq,62,,,62261000BM0034,,,660,,,,,,,,,,1,3,Dépendance,,0,,,,,,1.576334,50.481613
2019-927700,2019-02-12,000001,Vente,380000,1024,,RES SUNNY BEACH,A052,62780,62261,Cucq,62,,,62261000BM0034,,,633,,,,,,,,,,1,2,Appartement,87,4,,,,,,1.576334,50.481613
2019-927700,2019-02-12,000001,Vente,380000,976,,RES SUNNY BEACH,A052,62780,62261,Cucq,62,,,62261000BM0034,,,301,,,,,,,,,,1,3,Dépendance,,0,,,,,,1.576334,50.481613
2019-927706,2019-02-28,000001,Vente,70000,1081,,RES APPOLO ET SOYOUZ,A003,62780,62261,Cucq,62,,,62261000BE0439,,,93,,,,,,,,,,1,3,Dépendance,,0,,,,,,1.60249,50.482273
2019-927706,2019-02-28,000001,Vente,70000,445,,RES APPOLO ET SOYOUZ,A003,62780,62261,Cucq,62,,,62261000BE0439,,,62,,,,,,,,,,1,2,Appartement,36,2,,,,,,1.60249,50.482273
2019-927706,2019-02-28,000001,Vente,70000,1081,,RES APPOLO ET SOYOUZ,A003,62780,62261,Cucq,62,,,62261000BE0439,,,8,,,,,,,,,,1,3,Dépendance,,0,,,,,,1.60249,50.482273
2019-927709,2019-02-11,000001,Vente,182000,774,,AV D ETAPLES,0430,62780,62261,Cucq,62,,,62261000AC0183,,,,,,,,,,,,,0,1,Maison,96,5,S,sols,,,418,1.630762,50.50819
2019-927709,2019-02-11,000001,Vente,182000,,,AV D ETAPLES,0430,62780,62261,Cucq,62,,,62261000AC0289,,,,,,,,,,,,,0,,,,,S,sols,,,18,1.630578,50.508254
2019-927713,2019-02-08,000001,Vente,11780,,,LA MOULIERE DE TREPIED,B046,62780,62261,Cucq,62,,,62261000ZD0021,,,,,,,,,,,,,0,,,,,T,terres,,,20667,1.634009,50.504569
2019-927719,2019-02-27,000001,Vente,90000,1640,,BD EDMOND LABRASSE,0410,62780,62261,Cucq,62,,,62261000BL0151,,,39,,,,,,,,,,1,3,Dépendance,,0,,,,,,1.585447,50.480953
2019-927719,2019-02-27,000001,Vente,90000,1640,,BD EDMOND LABRASSE,0410,62780,62261,Cucq,62,,,62261000BL0151,,,26,,,,,,,,,,1,2,Appartement,39,2,,,,,,1.585447,50.480953
2019-927719,2019-02-27,000001,Vente,90000,1640,,BD EDMOND LABRASSE,0410,62780,62261,Cucq,62,,,62261000BL0151,,,12,,,,,,,,,,1,3,Dépendance,,0,,,,,,1.585447,50.480953
2019-927722,2019-02-27,000001,Vente,48000,977,,BD D ANGLETERRE,0070,62780,62261,Cucq,62,,,62261000BK0432,,,6,,,,,,,,,,1,2,Appartement,40,1,,,,,,1.587842,50.476432
2019-927724,2019-02-12,000001,Vente,130000,1837,,RES LES MARINES BD LABRASSE,A025,62780,62261,Cucq,62,,,62261000BL0002,,,206,,,,,,,,,,1,2,Appartement,42,3,,,,,,1.582049,50.480023
2019-927724,2019-02-12,000001,Vente,130000,1847,,RES LES MARINES BD LABRASSE,A025,62780,62261,Cucq,62,,,62261000BL0002,,,241,,,,,,,,,,1,3,Dépendance,,0,,,,,,1.582049,50.480023
2019-927741,2019-02-25,000001,Vente,115000,,,LE BOIS JOLI,B006,62780,62261,Cucq,62,,,62261000BI1103,,,,,,,,,,,,,0,,,,,AB,terrains a bâtir,,,644,1.5903,50.472644
2019-927741,2019-02-25,000001,Vente,115000,,,LE BOIS JOLI,B006,62780,62261,Cucq,62,,,62261000BI1110,,,,,,,,,,,,,0,,,,,AB,terrains a bâtir,,,139,1.590145,50.472553
2019-927744,2019-02-12,000001,Vente,45370,1057,,AV DE VERDUN,1280,62780,62261,Cucq,62,,,62261000BE0431,,,5,,,,,,,,,,1,3,Dépendance,,0,,,,,,1.601361,50.482161
2019-927744,2019-02-12,000001,Vente,45370,1057,,AV DE VERDUN,1280,62780,62261,Cucq,62,,,62261000BE0431,,,59,,,,,,,,,,1,2,Appartement,16,1,,,,,,1.601361,50.482161
2019-927744,2019-02-12,000001,Vente,45370,1057,,AV DE VERDUN,1280,62780,62261,Cucq,62,,,62261000BE0431,,,68,,,,,,,,,,1,3,Dépendance,,0,,,,,,1.601361,50.482161
2019-927746,2019-02-14,000001,Vente,65000,134,,RES PITCHOUNETS AV DUFOUR,A028,62780,62261,Cucq,62,,,62261000BK0544,,,26,,,,,,,,,,1,2,Appartement,26,1,,,,,,1.587002,50.478331
2019-927746,2019-02-14,000001,Vente,65000,134,,RES PITCHOUNETS AV DUFOUR,A028,62780,62261,Cucq,62,,,62261000BK0544,,,37,,,,,,,,,,1,3,Dépendance,,0,,,,,,1.587002,50.478331
2019-927746,2019-02-14,000001,Vente,65000,134,,RES PITCHOUNETS AV DUFOUR,A028,62780,62261,Cucq,62,,,62261000BK0544,,,22,,,,,,,,,,1,3,Dépendance,,0,,,,,,1.587002,50.478331
2019-927747,2019-02-13,000001,Vente,341000,43,,AV DE LA LIBERATION,0750,62780,62261,Cucq,62,,,62261000AY0094,,,,,,,,,,,,,0,1,Maison,117,6,S,sols,,,680,1.617528,50.474046
2019-927747,2019-02-13,000001,Vente,341000,,,LE BOUT DE HAUT,B007,62780,62261,Cucq,62,,,62261000AY0208,,,,,,,,,,,,,0,,,,,AG,terrains d'agrément,,,1198,1.617378,50.473874
2019-927747,2019-02-13,000001,Vente,341000,,,LE BOUT DE HAUT,B007,62780,62261,Cucq,62,,,62261000AY0220,,,,,,,,,,,,,0,,,,,J,jardins,POTAG,Jardin potager,300,1.617082,50.473784
2019-927747,2019-02-13,000001,Vente,341000,,,LE BOUT DE HAUT,B007,62780,62261,Cucq,62,,,62261000AY0222,,,,,,,,,,,,,0,,,,,J,jardins,POTAG,Jardin potager,44,1.617101,50.473991
2019-927747,2019-02-13,000001,Vente,341000,,,LE BOUT DE HAUT,B007,62780,62261,Cucq,62,,,62261000AY0224,,,,,,,,,,,,,0,,,,,P,prés,,,393,1.617348,50.474083
2019-927766,2019-02-08,000001,Vente,95000,1791,,RES VILLA SANDRA BD LABRASSE,A040,62780,62261,Cucq,62,,,62261000BL0018,,,14,,,,,,,,,,1,2,Appartement,28,2,,,,,,1.583639,50.48025
2019-927766,2019-02-08,000001,Vente,95000,1791,,RES VILLA SANDRA BD LABRASSE,A040,62780,62261,Cucq,62,,,62261000BL0018,,,34,,,,,,,,,,1,3,Dépendance,,0,,,,,,1.583639,50.48025
2019-927780,2019-02-12,000001,Vente,105500,1941,,BD EDMOND LABRASSE,0410,62780,62261,Cucq,62,,,62261000BM0479,,,6,,,,,,,,,,1,2,Appartement,63,2,,,,,,1.58141,50.480093
2019-927822,2019-02-25,000001,Vente,132500,626,,RES DOMAINE DES PINS BD LABRAS,A010,62780,62261,Cucq,62,,,62261000BE0679,,,308,,,,,,,,,,1,3,Dépendance,,0,,,,,,1.600316,50.483352
2019-927822,2019-02-25,000001,Vente,132500,626,,RES DOMAINE DES PINS BD LABRAS,A010,62780,62261,Cucq,62,,,62261000BE0679,,,307,,,,,,,,,,1,3,Dépendance,,0,,,,,,1.600316,50.483352
2019-927822,2019-02-25,000001,Vente,132500,626,,RES DOMAINE DES PINS BD LABRAS,A010,62780,62261,Cucq,62,,,62261000BE0679,,,301,,,,,,,,,,1,1,Maison,32,3,,,,,,1.600316,50.483352
2019-927826,2019-02-28,000001,Vente,281200,190,,AV DU BOIS LURETTE,0173,62780,62261,Cucq,62,,,62261000BI0003,,,,,,,,,,,,,0,1,Maison,93,5,S,sols,,,454,1.589184,50.473398
2019-927826,2019-02-28,000001,Vente,281200,,,LE BOIS JOLI,B006,62780,62261,Cucq,62,,,62261000BI0004,,,,,,,,,,,,,0,,,,,AB,terrains a bâtir,,,112,1.588989,50.473263
2019-927844,2019-03-11,000001,Vente,103000,1438,,BD EDMOND LABRASSE,0410,62780,62261,Cucq,62,,,62261000BL0292,,,37,,,,,,,,,,1,3,Dépendance,,0,,,,,,1.588201,50.481346
2019-927844,2019-03-11,000001,Vente,103000,1438,,BD EDMOND LABRASSE,0410,62780,62261,Cucq,62,,,62261000BL0292,,,28,,,,,,,,,,1,2,Appartement,53,3,,,,,,1.588201,50.481346
2019-927844,2019-03-11,000001,Vente,103000,1438,,BD EDMOND LABRASSE,0410,62780,62261,Cucq,62,,,62261000BL0292,,,6,,,,,,,,,,1,3,Dépendance,,0,,,,,,1.588201,50.481346
2019-927845,2019-03-07,000001,Vente,217500,292,,BD VICTOR POULAIN,1330,62780,62261,Cucq,62,,,62261000BD0517,,,,,,,,,,,,,0,1,Maison,37,3,S,sols,,,638,,
2019-927850,2019-03-15,000001,Vente,133000,9001,,RES SYLVA RUE GALLIENI,A054,62780,62261,Cucq,62,,,62261000BH0214,,,3,,,,,,,,,,1,3,Dépendance,,0,,,,,,1.592327,50.482938
2019-927850,2019-03-15,000001,Vente,133000,9001,,RES SYLVA RUE GALLIENI,A054,62780,62261,Cucq,62,,,62261000BH0214,,,7,,,,,,,,,,1,2,Appartement,40,2,,,,,,1.592327,50.482938
2019-927850,2019-03-15,000001,Vente,133000,9001,,RES SYLVA RUE GALLIENI,A054,62780,62261,Cucq,62,,,62261000BH0214,,,18,,,,,,,,,,1,3,Dépendance,,0,,,,,,1.592327,50.482938
2019-927857,2019-03-09,000001,Vente,150000,702,,BD DE LA MER,0860,62780,62261,Cucq,62,,,62261000BN0220,,,10,,,,,,,,,,1,3,Dépendance,,0,,,,,,1.57655,50.479125
2019-927857,2019-03-09,000001,Vente,150000,702,,BD DE LA MER,0860,62780,62261,Cucq,62,,,62261000BN0220,,,6,,,,,,,,,,1,2,Appartement,29,1,,,,,,1.57655,50.479125
2019-927859,2019-03-08,000001,Vente,124000,114,,RES GREEN WOOD BD D ANGLETERRE,A020,62780,62261,Cucq,62,,,62261000BD0482,,,36,,,,,,,,,,1,3,Dépendance,,0,,,,,,1.598265,50.473396
2019-927859,2019-03-08,000001,Vente,124000,114,,RES GREEN WOOD BD D ANGLETERRE,A020,62780,62261,Cucq,62,,,62261000BD0482,,,18,,,,,,,,,,1,2,Appartement,50,4,,,,,,1.598265,50.473396
2019-927862,2019-03-01,000001,Vente,109000,684,,RES LE GRAND SUD - RUE LILLE,A021,62780,62261,Cucq,62,,,62261000BL0256,,,5,,,,,,,,,,1,3,Dépendance,,0,,,,,,1.588758,50.480018
2019-927862,2019-03-01,000001,Vente,109000,684,,RES LE GRAND SUD - RUE LILLE,A021,62780,62261,Cucq,62,,,62261000BL0256,,,83,,,,,,,,,,1,3,Dépendance,,0,,,,,,1.588758,50.480018
2019-927862,2019-03-01,000001,Vente,109000,684,,RES LE GRAND SUD - RUE LILLE,A021,62780,62261,Cucq,62,,,62261000BL0256,,,56,,,,,,,,,,1,2,Appartement,34,2,,,,,,1.588758,50.480018
2019-927864,2019-03-14,000001,Vente,95000,,,LA PLAINE NONOTTE,B059,62780,62261,Cucq,62,,,62261000BC0164,,,,,,,,,,,,,0,,,,,AB,terrains a bâtir,,,800,1.60446,50.481093
2019-927875,2019-03-16,000001,Vente,238000,80,,CHE MONTOR,0929,62780,62261,Cucq,62,,,62261000AB0024,,,,,,,,,,,,,0,1,Maison,104,8,S,sols,,,431,1.624632,50.505895
2019-927891,2019-03-08,000001,Vente,105000,360,,RES FONTAINE MEDICIS AV EUROPE,A019,62780,62261,Cucq,62,,,62261000AB0070,,,84,,,,,,,,,,1,4,Local industriel. commercial ou assimilé,19,0,,,,,,1.626252,50.509702
2019-927894,2019-03-18,000001,Vente,60000,702,,BD DE LA MER,0860,62780,62261,Cucq,62,,,62261000BN0220,,,11,,,,,,,,,,1,3,Dépendance,,0,,,,,,1.57655,50.479125
2019-927894,2019-03-18,000001,Vente,60000,702,,BD DE LA MER,0860,62780,62261,Cucq,62,,,62261000BN0220,,,2,,,,,,,,,,1,2,Appartement,48,2,,,,,,1.57655,50.479125
2019-927898,2019-03-04,000001,Vente,150000,844,,BD D ANGLETERRE,0070,62780,62261,Cucq,62,,,62261000BI0225,,,,,,,,,,,,,0,1,Maison,33,2,S,sols,,,340,1.589663,50.476419
2019-927898,2019-03-04,000001,Vente,150000,,,LE BOIS JOLI,B006,62780,62261,Cucq,62,,,62261000BI0226,,,,,,,,,,,,,0,,,,,AB,terrains a bâtir,,,114,1.589526,50.476221
2019-927904,2019-03-18,000001,Vente,2000,1073,,RES LE CLOS LUCE - AV VERDUN,A036,62780,62261,Cucq,62,,,62261000BE0431,,,140,,,,,,,,,,1,3,Dépendance,,0,,,,,,1.601361,50.482161
2019-927906,2019-02-23,000001,Vente,211000,,,AV DE LA VICTOIRE,1310,62780,62261,Cucq,62,,,62261000BH1055,,,,,,,,,,,,,0,,,,,S,sols,,,346,1.594161,50.483207
2019-927914,2019-02-25,000001,Vente,423000,243,,AV DE LA VICTOIRE,1310,62780,62261,Cucq,62,,,62261000BH0543,,,,,,,,,,,,,0,1,Maison,128,5,S,sols,,,716,1.593974,50.483913
2019-927924,2019-03-23,000001,Vente,140000,43,,RUE DU CALVAIRE,0200,62780,62261,Cucq,62,,,62261000AS0217,,,,,,,,,,,,,0,1,Maison,72,3,S,sols,,,680,1.62493,50.483304
2019-927927,2019-02-27,000001,Vente,225000,1815,,RES SANTA FE - BD E. LABRASSE,A045,62780,62261,Cucq,62,,,62261000BL0020,,,71,,,,,,,,,,1,3,Dépendance,,0,,,,,,1.583438,50.48019
2019-927927,2019-02-27,000001,Vente,225000,1768,,RES SANTA MONICA BD E LABRASSE,A047,62780,62261,Cucq,62,,,62261000BL0064,,,10,,,,,,,,,,1,2,Appartement,74,3,,,,,,1.58356,50.480698
2019-927933,2019-03-26,000001,Vente,17000,283,,AV DU TOUQUET,1270,62780,62261,Cucq,62,,,62261000BE0669,,,19,,,,,,,,,,1,3,Dépendance,,0,,,,,,1.601066,50.484007
2019-927958,2019-03-07,000001,Vente,340000,164,,AV DES GRILLONS,0610,62780,62261,Cucq,62,,,62261000AH0233,,,,,,,,,,,,,0,1,Maison,74,3,S,sols,,,433,1.625569,50.500596
2019-927984,2019-03-20,000001,Vente,106000,137,,RUE DE DOUAI,0380,62780,62261,Cucq,62,,,62261000BI0920,,,2,,,,,,,,,,1,2,Appartement,30,1,,,,,,1.592786,50.47285
2019-927984,2019-03-20,000001,Vente,106000,137,,RUE DE DOUAI,0380,62780,62261,Cucq,62,,,62261000BI0920,,,2,,,,,,,,,,1,3,Dépendance,,0,,,,,,1.592786,50.47285