id_mutation,date_mutation,numero_disposition,nature_mutation,valeur_fonciere,adresse_numero,adresse_suffixe,adresse_nom_voie,adresse_code_voie,code_postal,code_commune,nom_commune,code_departement,ancien_code_commune,ancien_nom_commune,id_parcelle,ancien_id_parcelle,numero_volume,lot1_numero,lot1_surface_carrez,lot2_numero,lot2_surface_carrez,lot3_numero,lot3_surface_carrez,lot4_numero,lot4_surface_carrez,lot5_numero,lot5_surface_carrez,nombre_lots,code_type_local,type_local,surface_reelle_bati,nombre_pieces_principales,code_nature_culture,nature_culture,code_nature_culture_speciale,nature_culture_speciale,surface_terrain,longitude,latitude
2019-927325,2019-01-16,000001,Vente,28000,,,PRE DU PONT,B053,62155,62571,Merlimont,62,,,625710000A0877,,,,,,,,,,,,,0,,,,,BT,taillis simples,,,2031,1.625649,50.460173
2019-927325,2019-01-16,000001,Vente,28000,,,PRE DU PONT,B053,62155,62571,Merlimont,62,,,625710000A0880,,,,,,,,,,,,,0,,,,,AB,terrains a bâtir,,,2132,1.625514,50.459943
2019-927325,2019-01-16,000001,Vente,28000,,,PRE DU PONT,B053,62155,62571,Merlimont,62,,,625710000A0881,,,,,,,,,,,,,0,,,,,AG,terrains d'agrément,,,1936,1.62534,50.459701
2019-927332,2019-01-10,000001,Vente,125000,,,LE VILLAGE,B077,62155,62571,Merlimont,62,,,62571000AY0168,,,,,,,,,,,,,0,,,,,AB,terrains a bâtir,,,4,1.613179,50.45797
2019-927332,2019-01-10,000001,Vente,125000,,,LE VILLAGE,B077,62155,62571,Merlimont,62,,,62571000AY0169,,,,,,,,,,,,,0,,,,,AB,terrains a bâtir,,,36,1.613308,50.458029
2019-927332,2019-01-10,000001,Vente,125000,236,,RUE JOSEPH DAUBREGE,0335,62155,62571,Merlimont,62,,,62571000AY0175,,,,,,,,,,,,,0,1,Maison,77,3,S,sols,,,58,1.612804,50.457967
2019-927332,2019-01-10,000001,Vente,125000,236,,RUE JOSEPH DAUBREGE,0335,62155,62571,Merlimont,62,,,62571000AY0175,,,,,,,,,,,,,0,1,Maison,77,3,S,sols,,,58,1.612804,50.457967
2019-927332,2019-01-10,000001,Vente,125000,236,,RUE JOSEPH DAUBREGE,0335,62155,62571,Merlimont,62,,,62571000AY0175,,,,,,,,,,,,,0,1,Maison,77,3,S,sols,,,58,1.612804,50.457967
2019-927332,2019-01-10,000001,Vente,125000,236,,RUE JOSEPH DAUBREGE,0335,62155,62571,Merlimont,62,,,62571000AY0175,,,,,,,,,,,,,0,1,Maison,77,3,S,sols,,,58,1.612804,50.457967
2019-927345,2019-01-14,000001,Vente,240000,15,,RES CLOS DES PEINTRES-R CASINO,A010,62155,62571,Merlimont,62,,,62571000AK0136,,,8,,,,,,,,,,1,2,Appartement,93,4,,,,,,1.574827,50.460276
2019-927345,2019-01-14,000001,Vente,240000,15,,RES CLOS DES PEINTRES-R CASINO,A010,62155,62571,Merlimont,62,,,62571000AK0136,,,21,,,,,,,,,,1,3,Dépendance,,0,,,,,,1.574827,50.460276
2019-927349,2019-01-15,000001,Vente,34000,15,,RUE DE BRETAGNE,0092,62155,62571,Merlimont,62,,,62571000AK0200,,,25,,,,,,,,,,1,3,Dépendance,,0,,,,,,1.572488,50.460079
2019-927389,2019-01-21,000001,Vente,305000,1035,,RUE MARC FACOMPRE,0402,62155,62571,Merlimont,62,,,62571000BA0004,,,,,,,,,,,,,0,1,Maison,144,5,S,sols,,,935,1.605255,50.456406
2019-927438,2019-01-31,000001,Vente,95000,,,RUE DE BERCK,0071,62155,62571,Merlimont,62,,,62571000BI0083,,,,,,,,,,,,,0,,,,,AB,terrains a bâtir,,,933,1.612631,50.440075
2019-927456,2019-01-26,000001,Vente,242000,,,RUE DE TOURVILLE,0625,62155,62571,Merlimont,62,,,62571000AH0118,,,,,,,,,,,,,0,,,,,AB,terrains a bâtir,,,65,1.578466,50.465208
2019-927456,2019-01-26,000001,Vente,242000,55,,RUE DE TOURVILLE,0625,62155,62571,Merlimont,62,,,62571000AH0119,,,,,,,,,,,,,0,1,Maison,49,3,S,sols,,,222,1.578313,50.465236
2019-927488,2019-02-06,000001,Vente,66000,26,,AV DE LA PLAGE,0506,62155,62571,Merlimont,62,,,62571000AI0537,,,1,,,,,,,,,,1,2,Appartement,37,2,,,,,,1.574144,50.462485
2019-927502,2019-01-18,000001,Vente,78000,13,,RUE DUGUAY TROUIN,0119,62155,62571,Merlimont,62,,,62571000AM0599,,,,,,,,,,,,,0,2,Appartement,40,3,S,sols,,,84,1.578575,50.461179
2019-927502,2019-01-18,000001,Vente,78000,,,RUE DUGUAY TROUIN,0119,62155,62571,Merlimont,62,,,62571000AM0604,,,,,,,,,,,,,0,,,,,AB,terrains a bâtir,,,50,1.578683,50.461161
2019-927509,2019-01-21,000001,Vente,80000,9,,RUE DUGUAY TROUIN,0119,62155,62571,Merlimont,62,,,62571000AM0601,,,,,,,,,,,,,0,2,Appartement,40,3,S,sols,,,66,1.578621,50.461291
2019-927509,2019-01-21,000001,Vente,80000,,,RUE DUGUAY TROUIN,0119,62155,62571,Merlimont,62,,,62571000AM0602,,,,,,,,,,,,,0,,,,,AB,terrains a bâtir,,,119,1.57867,50.4613
2019-927510,2019-01-17,000001,Vente,83000,3,,PL DE LA GARE,0209,62155,62571,Merlimont,62,,,62571000AM0273,,,18,,,,,,,,,,1,3,Dépendance,,0,,,,,,1.580685,50.460902
2019-927510,2019-01-17,000001,Vente,83000,3,,PL DE LA GARE,0209,62155,62571,Merlimont,62,,,62571000AM0273,,,6,,,,,,,,,,1,2,Appartement,41,2,,,,,,1.580685,50.460902
2019-927515,2019-02-08,000001,Vente,15500,9000,,RES COTTAGES DE LA PLAGE AL171,A025,62155,62571,Merlimont,62,,,62571000AL0171,,,2316,,,,,,,,,,1,3,Dépendance,,0,,,,,,1.576087,50.458954
2019-927519,2019-02-08,000001,Vente,107000,189,,RES COTTAGES DE LA PLAGE AL135,A041,62155,62571,Merlimont,62,,,62571000AL0135,,,1371,,,,,,,,,,1,3,Dépendance,,0,,,,,,1.576206,50.458548
2019-927519,2019-02-08,000001,Vente,107000,321,,RES COTTAGES PLAGE - BAT CARLA,A023,62155,62571,Merlimont,62,,,62571000AL0169,,,2203,,,,,,,,,,1,2,Appartement,40,2,,,,,,1.575229,50.458724
2019-927522,2019-02-06,000001,Vente,150000,99,,BD DE STELLA PLAGE,0590,62155,62571,Merlimont,62,,,62571000AP0372,,,,,,,,,,,,,0,1,Maison,65,3,S,sols,,,240,1.591714,50.460848
2019-927522,2019-02-06,000001,Vente,150000,,,BD DE STELLA PLAGE,0590,62155,62571,Merlimont,62,,,62571000AP0374,,,,,,,,,,,,,0,,,,,AB,terrains a bâtir,,,80,1.591922,50.46081
2019-927523,2019-01-25,000001,Vente,130000,100,,AV D ARTOIS,0040,62155,62571,Merlimont,62,,,62571000AM0340,,,,,,,,,,,,,0,1,Maison,80,3,S,sols,,,205,1.579174,50.460654
2019-927523,2019-01-25,000001,Vente,130000,,,AV D ARTOIS,0040,62155,62571,Merlimont,62,,,62571000AM0341,,,,,,,,,,,,,0,,,,,AB,terrains a bâtir,,,62,1.579262,50.460783
2019-927534,2019-01-19,000001,Vente,91000,186,,AV DE LA PLAGE,0506,62155,62571,Merlimont,62,,,62571000AP0323,,,,,,,,,,,,,0,1,Maison,90,4,S,sols,,,423,1.588508,50.460118
2019-927550,2019-02-12,000001,Vente,59500,,,RUE DES HUTTES,0240,62155,62571,Merlimont,62,,,62571000AC0013,,,,,,,,,,,,,0,,,,,AB,terrains a bâtir,,,75,1.58998,50.464227
2019-927550,2019-02-12,000001,Vente,59500,,,RUE DES HUTTES,0240,62155,62571,Merlimont,62,,,62571000AC0014,,,,,,,,,,,,,0,,,,,AB,terrains a bâtir,,,349,1.590192,50.464192
2019-927557,2019-02-08,000001,Vente,79700,44,B,AV DU NORD,0420,62155,62571,Merlimont,62,,,62571000AH0252,,,21,,,,,,,,,,1,2,Appartement,33,2,,,,,,1.576279,50.464269
2019-927566,2019-01-23,000001,Vente,137000,829,,RUE CAMILLE DELACROIX,0093,62155,62571,Merlimont,62,,,62571000AR0017,,,,,,,,,,,,,0,1,Maison,41,2,S,sols,,,675,1.602768,50.457594
2019-927580,2019-01-28,000002,Vente,75000,,,IMP DU BOUT D ERLOT,0084,62155,62571,Merlimont,62,,,62571000AV0251,,,,,,,,,,,,,0,,,,,P,prés,,,900,1.619308,50.464216
2019-927581,2019-01-30,000001,Vente,280000,387,,RUE AUGUSTE BIBLOCQ,0042,62155,62571,Merlimont,62,,,62571000BC0013,,,,,,,,,,,,,0,1,Maison,120,5,J,jardins,,,760,1.614803,50.452538
2019-927581,2019-01-30,000001,Vente,280000,387,,RUE AUGUSTE BIBLOCQ,0042,62155,62571,Merlimont,62,,,62571000BC0013,,,,,,,,,,,,,0,1,Maison,120,5,S,sols,,,700,1.614803,50.452538
2019-927589,2019-01-31,000001,Vente,170000,,,AV DE LA GRANDE ARMADA,0220,62155,62571,Merlimont,62,,,62571000AC0109,,,,,,,,,,,,,0,,,,,AB,terrains a bâtir,,,49,1.591444,50.463055
2019-927589,2019-01-31,000001,Vente,170000,617,,AV DE LA GRANDE ARMADA,0220,62155,62571,Merlimont,62,,,62571000AC0110,,,,,,,,,,,,,0,1,Maison,70,4,S,sols,,,299,1.591523,50.463194
2019-927598,2019-02-06,000001,Vente,319300,347,,RES LES LILAS AV BEAUSEJOUR,A059,62155,62571,Merlimont,62,,,62571000AD0331,,,61,,,,,,,,,,1,3,Dépendance,,0,,,,,,1.587322,50.462496
2019-927598,2019-02-06,000001,Vente,319300,347,,RES LES LILAS AV BEAUSEJOUR,A059,62155,62571,Merlimont,62,,,62571000AD0331,,,2,,,,,,,,,,1,3,Dépendance,,0,,,,,,1.587322,50.462496
2019-927598,2019-02-06,000001,Vente,319300,347,,RES LES LILAS AV BEAUSEJOUR,A059,62155,62571,Merlimont,62,,,62571000AD0331,,,30,,,,,,,,,,1,3,Dépendance,,0,,,,,,1.587322,50.462496
2019-927598,2019-02-06,000001,Vente,319300,347,,RES LES LILAS AV BEAUSEJOUR,A059,62155,62571,Merlimont,62,,,62571000AD0331,,,51,,,,,,,,,,1,2,Appartement,77,4,,,,,,1.587322,50.462496
2019-927599,2019-01-29,000001,Vente,73376,,,LES VACANCES A LA MER,B075,62155,62571,Merlimont,62,,,625710000E1512,,,,,,,,,,,,,0,,,,,L,landes,,,400,1.59179,50.459632
2019-927599,2019-01-29,000001,Vente,73376,,,LES VACANCES A LA MER,B075,62155,62571,Merlimont,62,,,625710000E2297,,,,,,,,,,,,,0,,,,,L,landes,,,400,1.591935,50.4596
2019-927600,2019-01-29,000002,Vente,225624,,,LES VACANCES A LA MER,B075,62155,62571,Merlimont,62,,,625710000E3410,,,,,,,,,,,,,0,,,,,AB,terrains a bâtir,,,2460,,
2019-927619,2019-01-28,000001,Vente,69000,,,RUE CAMILLE DELACROIX,0093,62155,62571,Merlimont,62,,,62571000BA0240,,,,,,,,,,,,,0,,,,,AB,terrains a bâtir,,,553,1.607276,50.455657
2019-927708,2019-02-07,000001,Vente,108000,549,,AV BEAU SEJOUR,0060,62155,62571,Merlimont,62,,,62571000AC0388,,,,,,,,,,,,,0,1,Maison,38,3,S,sols,,,250,1.590117,50.462191
2019-927708,2019-02-07,000001,Vente,108000,,,AV BEAU SEJOUR,0060,62155,62571,Merlimont,62,,,62571000AC0389,,,,,,,,,,,,,0,,,,,AB,terrains a bâtir,,,51,1.59004,50.462069
2019-927716,2019-02-26,000001,Vente,189000,,,AV DES SAPINS,0570,62155,62571,Merlimont,62,,,62571000AD0113,,,,,,,,,,,,,0,,,,,AB,terrains a bâtir,,,51,1.588236,50.464152
2019-927716,2019-02-26,000001,Vente,189000,368,,AV DES SAPINS,0570,62155,62571,Merlimont,62,,,62571000AD0114,,,,,,,,,,,,,0,1,Maison,36,3,S,sols,,,297,1.58818,50.463976
2019-927717,2019-02-25,000001,Vente,130000,10,,RES SEA SIDE - RUE DES ALGUES,A095,62155,62571,Merlimont,62,,,62571000AH0467,,,2,,,,,,,,,,1,2,Appartement,44,3,,,,,,1.574107,50.465023
2019-927717,2019-02-25,000001,Vente,130000,10,,RES SEA SIDE - RUE DES ALGUES,A095,62155,62571,Merlimont,62,,,62571000AH0467,,,21,,,,,,,,,,1,3,Dépendance,,0,,,,,,1.574107,50.465023
2019-927717,2019-02-25,000001,Vente,130000,10,,RES SEA SIDE - RUE DES ALGUES,A095,62155,62571,Merlimont,62,,,62571000AH0467,,,23,,,,,,,,,,1,3,Dépendance,,0,,,,,,1.574107,50.465023
2019-927751,2019-02-14,000001,Vente,290000,538,,RUE DU BOUT D ERLOT,0083,62155,62571,Merlimont,62,,,62571000AX0124,,,,,,,,,,,,,0,1,Maison,128,5,S,sols,,,1212,1.61932,50.461844
2019-927755,2019-03-02,000001,Vente,86000,220,,AV ADOLPHE LEROY,0014,62155,62571,Merlimont,62,,,62571000AN0218,,,,,,,,,,,,,0,1,Maison,54,3,S,sols,,,328,1.58501,50.461416
2019-927775,2019-02-14,000001,Vente,180000,,,AV DU CALVAIRE,0090,62155,62571,Merlimont,62,,,62571000AI0447,,,,,,,,,,,,,0,,,,,AB,terrains a bâtir,,,177,1.574006,50.46121
2019-927775,2019-02-14,000001,Vente,180000,17,,AV DU CALVAIRE,0090,62155,62571,Merlimont,62,,,62571000AI0448,,,,,,,,,,,,,0,2,Appartement,40,3,S,sols,,,197,1.574075,50.461246
2019-927775,2019-02-14,000001,Vente,180000,17,,AV DU CALVAIRE,0090,62155,62571,Merlimont,62,,,62571000AI0448,,,,,,,,,,,,,0,2,Appartement,40,3,S,sols,,,197,1.574075,50.461246
2019-927775,2019-02-14,000001,Vente,180000,17,,AV DU CALVAIRE,0090,62155,62571,Merlimont,62,,,62571000AI0448,,,,,,,,,,,,,0,2,Appartement,40,3,S,sols,,,197,1.574075,50.461246
2019-927779,2019-02-14,000001,Vente,45000,,,HAGUE CADET,B026,62155,62571,Merlimont,62,,,625710000C1163,,,,,,,,,,,,,0,,,,,E,eaux,,,3725,1.626741,50.441194
2019-927779,2019-02-14,000001,Vente,45000,,,HAGUE CADET,B026,62155,62571,Merlimont,62,,,625710000C1164,,,,,,,,,,,,,0,,,,,E,eaux,,,2000,1.626935,50.441608
2019-927779,2019-02-14,000001,Vente,45000,,,HAGUE CADET,B026,62155,62571,Merlimont,62,,,625710000C1165,,,,,,,,,,,,,0,,,,,P,prés,,,3095,1.626434,50.44212
2019-927779,2019-02-14,000001,Vente,45000,,,HAGUE CADET,B026,62155,62571,Merlimont,62,,,625710000C1739,,,,,,,,,,,,,0,,,,,P,prés,,,1438,1.62626,50.442488
2019-927779,2019-02-14,000001,Vente,45000,,,HAGUE CADET,B026,62155,62571,Merlimont,62,,,625710000C1781,,,,,,,,,,,,,0,,,,,P,prés,,,310,1.62689,50.442828
2019-927787,2019-02-12,000001,Vente,90000,14,,AV DE FLANDRE,0180,62155,62571,Merlimont,62,,,62571000AI0609,,,5,,,,,,,,,,1,3,Dépendance,,0,,,,,,1.57387,50.46334
2019-927787,2019-02-12,000001,Vente,90000,14,,AV DE FLANDRE,0180,62155,62571,Merlimont,62,,,62571000AI0609,,,1,,,,,,,,,,1,2,Appartement,37,3,,,,,,1.57387,50.46334
2019-927790,2019-02-15,000001,Vente,113000,4,,DOM DU LAC - ALL DES CYGNES,A056,62155,62571,Merlimont,62,,,625710000E3354,,,47,,,,,,,,,,1,2,Appartement,38,2,,,,,,1.588926,50.459073
2019-927810,2019-02-28,000001,Vente,102000,,,AV DE LONDRES,0380,62155,62571,Merlimont,62,,,62571000AE0124,,,,,,,,,,,,,0,,,,,AB,terrains a bâtir,,,60,1.578712,50.463325
2019-927810,2019-02-28,000001,Vente,102000,34,,AV DE LONDRES,0380,62155,62571,Merlimont,62,,,62571000AE0125,,,,,,,,,,,,,0,1,Maison,53,3,S,sols,,,114,1.578836,50.463352
2019-927824,2019-02-22,000001,Vente,115000,22,,RUE DE LA GARE,0210,62155,62571,Merlimont,62,,,62571000AO0234,,,3,,,,,,,,,,1,2,Appartement,39,3,,,,,,1.582519,50.460104
2019-927824,2019-02-22,000001,Vente,115000,22,,RUE DE LA GARE,0210,62155,62571,Merlimont,62,,,62571000AO0234,,,7,,,,,,,,,,1,3,Dépendance,,0,,,,,,1.582519,50.460104
2019-927831,2019-03-08,000001,Vente,77500,89,,RUE DU BOUT D ERLOT,0083,62155,62571,Merlimont,62,,,62571000AV0209,,,,,,,,,,,,,0,,,,,AG,terrains d'agrément,,,794,1.616186,50.464776
2019-927834,2019-03-11,000001,Vente,90000,9,,AV D ARTOIS,0040,62155,62571,Merlimont,62,,,62571000AI0516,,,13,,,,,,,,,,1,2,Appartement,41,2,,,,,,1.573284,50.461754
2019-927834,2019-03-11,000001,Vente,90000,9,,AV D ARTOIS,0040,62155,62571,Merlimont,62,,,62571000AI0516,,,3,,,,,,,,,,1,3,Dépendance,,0,,,,,,1.573284,50.461754
2019-927834,2019-03-11,000001,Vente,90000,11,,AV D ARTOIS,0040,62155,62571,Merlimont,62,,,62571000AI0516,,,29,,,,,,,,,,1,3,Dépendance,,0,,,,,,1.573284,50.461754
2019-927870,2019-02-22,000001,Vente,195000,294,,RUE AUGUSTE BIBLOCQ,0042,62155,62571,Merlimont,62,,,62571000BB0057,,,,,,,,,,,,,0,1,Maison,96,4,S,sols,,,520,1.613721,50.453179
2019-927872,2019-03-09,000001,Vente,146000,15,,RUE DE BRETAGNE,0092,62155,62571,Merlimont,62,,,62571000AK0200,,,46,,,,,,,,,,1,2,Appartement,33,2,,,,,,1.572488,50.460079
2019-927872,2019-03-09,000001,Vente,146000,15,,RUE DE BRETAGNE,0092,62155,62571,Merlimont,62,,,62571000AK0200,,,4,,,,,,,,,,1,3,Dépendance,,0,,,,,,1.572488,50.460079
2019-927872,2019-03-09,000001,Vente,146000,9001,,RES VISTAMAR RUE DE BRETAGNE,A200,62155,62571,Merlimont,62,,,62571000AK0256,,,59,,,,,,,,,,1,3,Dépendance,,0,,,,,,1.573761,50.459664
2019-927897,2019-03-20,000001,Vente,65000,30,,RUE DUGUAY TROUIN,0119,62155,62571,Merlimont,62,,,62571000AM0363,,,3,,,,,,,,,,1,2,Appartement,48,3,,,,,,1.578714,50.460586
2019-927913,2019-02-25,000001,Vente,4000,,,ALL DES BECASSES,0062,62155,62571,Merlimont,62,,,62571000AT0199,,,,,,,,,,,,,0,,,,,AB,terrains a bâtir,,,493,1.612375,50.463504
2019-927913,2019-02-25,000001,Vente,4000,,,LA POURIERE PATIS,B048,62155,62571,Merlimont,62,,,62571000AT0202,,,,,,,,,,,,,0,,,,,AG,terrains d'agrément,,,164,1.612579,50.463485
2019-927929,2019-03-01,000001,Vente,180000,202,,CHAUSSEE D EPY,B007,62155,62571,Merlimont,62,,,62571000BE0016,,,,,,,,,,,,,0,1,Maison,85,4,S,sols,,,1000,1.619613,50.443507
2019-927930,2019-03-14,000001,Vente,175000,1362,,RUE AUGUSTE BIBLOCQ,0042,62155,62571,Merlimont,62,,,62571000BH0092,,,,,,,,,,,,,0,1,Maison,91,3,S,sols,,,1059,1.616753,50.443921
2019-927936,2019-03-05,000001,Vente,150000,640,,AV DU PARC,0480,62155,62571,Merlimont,62,,,62571000AP0159,,,,,,,,,,,,,0,1,Maison,33,3,S,sols,,,247,1.591006,50.461198
2019-927936,2019-03-05,000001,Vente,150000,,,AV DU PARC,0480,62155,62571,Merlimont,62,,,62571000AP0160,,,,,,,,,,,,,0,,,,,AB,terrains a bâtir,,,50,1.591047,50.461304
2019-927949,2019-03-20,000001,Vente,125000,65,,AV DU NORD,0420,62155,62571,Merlimont,62,,,62571000AE0257,,,,,,,,,,,,,0,1,Maison,31,2,S,sols,,,179,1.578987,50.464352
2019-927949,2019-03-20,000001,Vente,125000,,,AV DU NORD,0420,62155,62571,Merlimont,62,,,62571000AE0258,,,,,,,,,,,,,0,,,,,AB,terrains a bâtir,,,30,1.578936,50.464199
2019-927950,2019-03-18,000001,Vente,146000,13,,DOM DU LAC - AV DU LAC,A055,62155,62571,Merlimont,62,,,625710000E3354,,,130,,,,,,,,,,1,2,Appartement,45,3,,,,,,1.588926,50.459073
2019-927953,2019-03-20,000002,Vente,140000,,,LES GARENNES,B019,62155,62571,Merlimont,62,,,625710000E3419,,,,,,,,,,,,,0,,,,,S,sols,,,480,1.589036,50.467328
2019-927974,2019-03-11,000001,Vente,75000,,,IMP DU BOUT D ERLOT,0084,62155,62571,Merlimont,62,,,62571000AV0250,,,,,,,,,,,,,0,,,,,P,prés,,,809,1.618998,50.464212
2019-927982,2019-03-25,000001,Vente,8460,,,RUE JOSEPH DAUBREGE,0335,62155,62571,Merlimont,62,,,62571000AY0164,,,,,,,,,,,,,0,,,,,P,prés,,,940,1.615477,50.457717
2019-927987,2019-03-30,000001,Vente,264750,111,,RUE DE LA PLAINE BOUCHART,0509,62155,62571,Merlimont,62,,,62571000BH0080,,,,,,,,,,,,,0,1,Maison,71,2,S,sols,,,700,1.614544,50.442261
2019-927987,2019-03-30,000001,Vente,264750,111,,RUE DE LA PLAINE BOUCHART,0509,62155,62571,Merlimont,62,,,62571000BH0080,,,,,,,,,,,,,0,1,Maison,71,2,J,jardins,,,1024,1.614544,50.442261
2019-927993,2019-03-20,000001,Vente,172500,161,,RUE DES GRANDES GARENNES,0225,62155,62571,Merlimont,62,,,625710000E1958,,,,,,,,,,,,,0,1,Maison,48,3,S,sols,,,992,1.591124,50.470196
2019-928018,2019-03-28,000001,Vente,44000,,,AV DU BOULONNAIS,0080,62155,62571,Merlimont,62,,,62571000AE0107,,,16,,,,,,,,,,1,3,Dépendance,,0,,,,,,1.578208,50.463317
2019-928018,2019-03-28,000001,Vente,44000,71,,AV DU BOULONNAIS,0080,62155,62571,Merlimont,62,,,62571000AE0107,,,15,,,,,,,,,,1,3,Dépendance,,0,,,,,,1.578208,50.463317
2019-928021,2019-03-30,000001,Vente,150000,187,,RES COTTAGES PLAGE -BAT LENA,A040,62155,62571,Merlimont,62,,,62571000AL0128,,,1005,,,,,,,,,,1,2,Appartement,41,2,,,,,,1.576234,50.458286
2019-928021,2019-03-30,000001,Vente,150000,189,,RES COTTAGES DE LA PLAGE AL135,A041,62155,62571,Merlimont,62,,,62571000AL0135,,,1304,,,,,,,,,,1,3,Dépendance,,0,,,,,,1.576206,50.458548
2019-928022,2019-03-20,000001,Vente,560000,8,,BD DE LA MANCHE,0400,62155,62571,Merlimont,62,,,62571000AH0011,,,,,,,,,,,,,0,1,Maison,99,6,S,sols,,,119,1.573638,50.465383
2019-928022,2019-03-20,000001,Vente,560000,,,BD DE LA MANCHE,0400,62155,62571,Merlimont,62,,,62571000AH0012,,,,,,,,,,,,,0,,,,,AB,terrains a bâtir,,,48,1.573436,50.465416
2019-928041,2019-03-30,000001,Vente,152000,111,,RES LORYMAR 1 AVE DE VENDEE,A060,62155,62571,Merlimont,62,,,62571000AK0169,,,169,,,,,,,,,,1,3,Dépendance,,0,,,,,,1.574437,50.45921
2019-928041,2019-03-30,000001,Vente,152000,31,,RES LORYMAR 5 - RUE DE VENDEE,A065,62155,62571,Merlimont,62,,,62571000AK0169,,,401,,,,,,,,,,1,2,Appartement,35,2,,,,,,1.574437,50.45921
2019-928041,2019-03-30,000001,Vente,152000,31,,RES LORYMAR 5 - RUE DE VENDEE,A065,62155,62571,Merlimont,62,,,62571000AK0169,,,382,,,,,,,,,,1,3,Dépendance,,0,,,,,,1.574437,50.45921
2019-928051,2019-03-26,000001,Vente,50000,744,,RUE D ETAPLES,0165,62155,62571,Merlimont,62,,,62571000AW0043,,,15,,,,,,,,,,1,1,Maison,78,2,,,,,,1.618701,50.472697
2019-928082,2019-03-16,000001,Vente,282500,55,,RUE DES PRES BALLY,0511,62155,62571,Merlimont,62,,,62571000AW0066,,,,,,,,,,,,,0,1,Maison,75,3,S,sols,,,236,1.617289,50.470977
2019-928082,2019-03-16,000001,Vente,282500,55,,RUE DES PRES BALLY,0511,62155,62571,Merlimont,62,,,62571000AW0066,,,,,,,,,,,,,0,1,Maison,75,3,J,jardins,,,645,1.617289,50.470977
2019-928090,2019-04-08,000001,Vente,198812,139,,RUE D ETAPLES,0165,62155,62571,Merlimont,62,,,62571000AV0240,,,,,,,,,,,,,0,1,Maison,82,4,AB,terrains a bâtir,,,515,1.614713,50.467518
2019-928113,2019-03-28,000001,Vente,235000,5411,,LE MARAIS DE BALANCON,B031,62155,62571,Merlimont,62,,,625710000B1010,,,,,,,,,,,,,0,3,Dépendance,,0,E,eaux,,,6920,1.638018,50.44218
2019-928113,2019-03-28,000001,Vente,235000,5411,,LE MARAIS DE BALANCON,B031,62155,62571,Merlimont,62,,,625710000B1010,,,,,,,,,,,,,0,3,Dépendance,,0,L,landes,,,8210,1.638018,50.44218
2019-928113,2019-03-28,000001,Vente,235000,,,LE MARAIS DE BALANCON,B031,62155,62571,Merlimont,62,,,625710000B1012,,,,,,,,,,,,,0,,,,,L,landes,,,4888,1.638162,50.442749
2019-928113,2019-03-28,000001,Vente,235000,,,LE MARAIS DE BALANCON,B031,62155,62571,Merlimont,62,,,625710000B1014,,,,,,,,,,,,,0,,,,,L,landes,,,1848,1.637735,50.44282
2019-928113,2019-03-28,000001,Vente,235000,,,LE MARAIS DE BALANCON,B031,62155,62571,Merlimont,62,,,625710000B1016,,,,,,,,,,,,,0,,,,,L,landes,,,1225,1.637099,50.442787
2019-928113,2019-03-28,000001,Vente,235000,,,LE MARAIS DE BALANCON,B031,62155,62571,Merlimont,62,,,625710000B1018,,,,,,,,,,,,,0,,,,,L,landes,,,547,1.636658,50.442779
2019-928122,2019-03-28,000001,Vente,115000,9001,,RUE DE NORMANDIE,0430,62155,62571,Merlimont,62,,,62571000AK0199,,,86,,,,,,,,,,1,3,Dépendance,,0,,,,,,1.572948,50.460235
2019-928122,2019-03-28,000001,Vente,115000,15,,RUE DE BRETAGNE,0092,62155,62571,Merlimont,62,,,62571000AK0200,,,33,,,,,,,,,,1,2,Appartement,20,1,,,,,,1.572488,50.460079
2019-928122,2019-03-28,000001,Vente,115000,15,,RUE DE BRETAGNE,0092,62155,62571,Merlimont,62,,,62571000AK0200,,,7,,,,,,,,,,1,3,Dépendance,,0,,,,,,1.572488,50.460079
2019-928125,2019-04-03,000001,Vente,145000,35,,RUE DE BRETAGNE,0092,62155,62571,Merlimont,62,,,62571000AK0199,,,124,,,,,,,,,,1,3,Dépendance,,0,,,,,,1.572948,50.460235
2019-928125,2019-04-03,000001,Vente,145000,35,,RUE DE BRETAGNE,0092,62155,62571,Merlimont,62,,,62571000AK0199,,,113,,,,,,,,,,1,3,Dépendance,,0,,,,,,1.572948,50.460235
2019-928125,2019-04-03,000001,Vente,145000,35,,RUE DE BRETAGNE,0092,62155,62571,Merlimont,62,,,62571000AK0199,,,155,,,,,,,,,,1,2,Appartement,33,2,,,,,,1.572948,50.460235
2019-928125,2019-04-03,000001,Vente,145000,9001,,RES VISTAMAR RUE DE BRETAGNE,A200,62155,62571,Merlimont,62,,,62571000AK0256,,,61,,,,,,,,,,1,3,Dépendance,,0,,,,,,1.573761,50.459664
2019-928128,2019-03-28,000001,Vente,13500,,,HAGUE AMBROISE,B025,62155,62571,Merlimont,62,,,625710000C0768,,,,,,,,,,,,,0,,,,,P,prés,,,5750,1.631949,50.45899
2019-928139,2019-04-06,000001,Vente,17000,189,,RES COTTAGES DE LA PLAGE AL135,A041,62155,62571,Merlimont,62,,,62571000AL0135,,,1316,,,,,,,,,,1,3,Dépendance,,0,,,,,,1.576206,50.458548
2019-928158,2019-03-22,000001,Vente,210000,274,,RUE MARC VINCENT,0404,62155,62571,Merlimont,62,,,62571000AY0128,,,,,,,,,,,,,0,1,Maison,75,3,AB,terrains a bâtir,,,861,1.617659,50.459299
2019-928166,2019-04-04,000001,Vente,59000,,,HAGUE CADET,B026,62155,62571,Merlimont,62,,,625710000C1170,,,,,,,,,,,,,0,,,,,E,eaux,,,5330,1.625702,50.442174
2019-928166,2019-04-04,000001,Vente,59000,,,HAGUE CADET,B026,62155,62571,Merlimont,62,,,625710000C1171,,,,,,,,,,,,,0,,,,,E,eaux,,,4400,1.62538,50.441556
2019-928166,2019-04-04,000001,Vente,59000,5425,,HAGUE CADET,B026,62155,62571,Merlimont,62,,,625710000C1287,,,,,,,,,,,,,0,3,Dépendance,,0,S,sols,,,10,1.62512,50.441632
2019-928167,2019-04-04,000001,Vente,10000,,,HAGUE CADET,B026,62155,62571,Merlimont,62,,,625710000C1162,,,,,,,,,,,,,0,,,,,L,landes,,,1680,1.626403,50.441024
2019-928169,2019-03-20,000001,Vente,1,,,PRE OSCAR,B059,62155,62571,Merlimont,62,,,62571000AX0162,,,,,,,,,,,,,0,,,,,AB,terrains a bâtir,,,418,1.617854,50.460155
2019-928169,2019-03-20,000001,Vente,1,,,LE GRAND PRE,B021,62155,62571,Merlimont,62,,,62571000AY0127,,,,,,,,,,,,,0,,,,,AB,terrains a bâtir,,,149,1.617846,50.459242
2019-928169,2019-03-20,000001,Vente,1,9000,,RUE MARC VINCENT,0404,62155,62571,Merlimont,62,,,62571000AY0132,,,,,,,,,,,,,0,4,Local industriel. commercial ou assimilé,,0,AB,terrains a bâtir,,,164,1.617556,50.460091
2019-928169,2019-03-20,000001,Vente,1,,,LE GRAND PRE,B021,62155,62571,Merlimont,62,,,62571000AY0133,,,,,,,,,,,,,0,,,,,AB,terrains a bâtir,,,786,1.617752,50.459856
2019-928174,2019-04-16,000001,Vente,70000,,,RUE DE RANG DU FLIERS,0530,62155,62571,Merlimont,62,,,62571000BI0092,,,,,,,,,,,,,0,,,,,AB,terrains a bâtir,,,910,1.615701,50.438074
2019-928175,2019-03-29,000001,Vente,100000,112,,RUE DES GUIGNEUX,0234,62155,62571,Merlimont,62,,,62571000AW0133,,,,,,,,,,,,,0,1,Maison,72,4,S,sols,,,446,1.614051,50.471884