id_mutation,date_mutation,numero_disposition,nature_mutation,valeur_fonciere,adresse_numero,adresse_suffixe,adresse_nom_voie,adresse_code_voie,code_postal,code_commune,nom_commune,code_departement,ancien_code_commune,ancien_nom_commune,id_parcelle,ancien_id_parcelle,numero_volume,lot1_numero,lot1_surface_carrez,lot2_numero,lot2_surface_carrez,lot3_numero,lot3_surface_carrez,lot4_numero,lot4_surface_carrez,lot5_numero,lot5_surface_carrez,nombre_lots,code_type_local,type_local,surface_reelle_bati,nombre_pieces_principales,code_nature_culture,nature_culture,code_nature_culture_speciale,nature_culture_speciale,surface_terrain,longitude,latitude
2019-908914,2019-01-23,000001,Vente,144887.12,,,PLAINE DU CHEMIN DE BEAUFE,B042,62111,62664,Pommier,62,,,62664000ZB0007,,,,,,,,,,,,,0,,,,,P,prés,,,6855,2.581411,50.183136
2019-908914,2019-01-23,000001,Vente,144887.12,,,PLAINE DU CHEMIN DE BEAUFE,B042,62111,62664,Pommier,62,,,62664000ZB0007,,,,,,,,,,,,,0,,,,,T,terres,,,6855,2.581411,50.183136
2019-908914,2019-01-23,000001,Vente,144887.12,,,LE MARQUOIS,B034,62111,62664,Pommier,62,,,62664000ZB0047,,,,,,,,,,,,,0,,,,,T,terres,,,4060,2.576187,50.173985
2019-908914,2019-01-23,000001,Vente,144887.12,,,LE MARQUOIS,B034,62111,62664,Pommier,62,,,62664000ZB0065,,,,,,,,,,,,,0,,,,,T,terres,,,2490,2.579074,50.180693
2019-908914,2019-01-23,000001,Vente,144887.12,,,LE MARQUOIS,B034,62111,62664,Pommier,62,,,62664000ZB0065,,,,,,,,,,,,,0,,,,,T,terres,,,1000,2.579074,50.180693
2019-908914,2019-01-23,000001,Vente,144887.12,,,CHEMIN DE SAINT AMAND,B011,62111,62664,Pommier,62,,,62664000ZI0018,,,,,,,,,,,,,0,,,,,T,terres,,,2760,2.586816,50.172893
2019-909322,2019-03-08,000001,Vente,5800,,,LES CINQ,B060,62111,62664,Pommier,62,,,62664000ZC0007,,,,,,,,,,,,,0,,,,,T,terres,,,4320,2.584585,50.187058
2019-909434,2019-03-24,000001,Vente,171300,4,,RUE DE BERLES,0020,62111,62664,Pommier,62,,,626640000A0547,,,,,,,,,,,,,0,1,Maison,106,3,S,sols,,,980,2.601539,50.184408
2019-909827,2019-04-12,000001,Vente,2000,,,LA VOIE DES CROIX,B056,62111,62664,Pommier,62,,,62664000ZC0034,,,,,,,,,,,,,0,,,,,T,terres,,,1650,2.592409,50.183985
2019-910069,2019-04-29,000001,Vente,38000,,,LE VILLAGE,B053,62111,62664,Pommier,62,,,626640000A0536,,,,,,,,,,,,,0,,,,,S,sols,,,290,2.6035,50.185008
2019-910069,2019-04-29,000001,Vente,38000,,,LE VILLAGE,B053,62111,62664,Pommier,62,,,626640000A0537,,,,,,,,,,,,,0,,,,,S,sols,,,580,,
2019-910069,2019-04-29,000001,Vente,38000,10,,RUE DE BERLES,0020,62111,62664,Pommier,62,,,626640000A0538,,,,,,,,,,,,,0,1,Maison,95,3,S,sols,,,590,2.603118,50.185144
2019-910069,2019-04-29,000001,Vente,38000,,,LE VILLAGE,B053,62111,62664,Pommier,62,,,626640000A0969,,,,,,,,,,,,,0,,,,,S,sols,,,66,2.60297,50.185092
2019-910069,2019-04-29,000001,Vente,38000,,,LE VILLAGE,B053,62111,62664,Pommier,62,,,626640000A0971,,,,,,,,,,,,,0,,,,,S,sols,,,76,2.603192,50.18491
2019-910069,2019-04-29,000001,Vente,38000,,,LE VILLAGE,B053,62111,62664,Pommier,62,,,626640000A1235,,,,,,,,,,,,,0,,,,,S,sols,,,26,2.602902,50.185099
2019-910069,2019-04-29,000001,Vente,38000,,,LE VILLAGE,B053,62111,62664,Pommier,62,,,626640000A1237,,,,,,,,,,,,,0,,,,,S,sols,,,92,2.603217,50.184851
2019-910588,2019-06-19,000001,Vente,2150,,,LA VOIE DES CROIX,B056,62111,62664,Pommier,62,,,62664000ZC0035,,,,,,,,,,,,,0,,,,,T,terres,,,2690,2.592233,50.183996
2019-910649,2019-06-03,000001,Vente,174000,16,,RUE DE ST MARTIN,0310,62111,62664,Pommier,62,,,626640000A0650,,,,,,,,,,,,,0,1,Maison,141,4,S,sols,,,865,2.598199,50.183092
2019-910649,2019-06-03,000001,Vente,174000,,,LE VILLAGE,B053,62111,62664,Pommier,62,,,626640000A0672,,,,,,,,,,,,,0,,,,,S,sols,,,317,2.598109,50.183333
2019-910649,2019-06-03,000001,Vente,174000,,,LE VILLAGE,B053,62111,62664,Pommier,62,,,626640000A0957,,,,,,,,,,,,,0,,,,,J,jardins,,,424,2.598216,50.183412
2019-911209,2019-07-15,000001,Vente,35000,,,VOIE DE LA CHAPELLE,B055,62111,62664,Pommier,62,,,626640000A0111,,,,,,,,,,,,,0,,,,,BF,futaies feuillues,,,2833,2.604548,50.184996
2019-911470,2019-08-23,000001,Vente,16924.4,,,LES DIX,B020,62111,62664,Pommier,62,,,62664000ZI0001,,,,,,,,,,,,,0,,,,,T,terres,,,11595,2.581908,50.170151
2019-911470,2019-08-23,000001,Vente,16924.4,,,LES DIX,B020,62111,62664,Pommier,62,,,62664000ZI0001,,,,,,,,,,,,,0,,,,,T,terres,,,5795,2.581908,50.170151
2019-912217,2019-09-30,000003,Vente,20000,,,LES SEIZE,B047,62111,62664,Pommier,62,,,62664000ZE0115,,,,,,,,,,,,,0,,,,,P,prés,,,1772,2.61331,50.178386
2019-912217,2019-09-30,000003,Vente,20000,,,LES SEIZE,B047,62111,62664,Pommier,62,,,62664000ZE0117,,,,,,,,,,,,,0,,,,,P,prés,,,3252,2.613062,50.178242
2019-912841,2019-12-05,000001,Vente,3800,,,LES QUATRE,B043,62111,62664,Pommier,62,,,62664000ZC0017,,,,,,,,,,,,,0,,,,,T,terres,,,400,2.589948,50.187643
2019-912841,2019-12-05,000001,Vente,3800,,,LES QUATRE,B043,62111,62664,Pommier,62,,,62664000ZC0017,,,,,,,,,,,,,0,,,,,T,terres,,,3250,2.589948,50.187643
2019-913131,2019-12-11,000001,Vente,137000,5,B,RUE DE ST MARTIN,0310,62111,62664,Pommier,62,,,626640000A1232,,,,,,,,,,,,,0,1,Maison,115,4,S,sols,,,410,2.600006,50.183712
