id_mutation,date_mutation,numero_disposition,nature_mutation,valeur_fonciere,adresse_numero,adresse_suffixe,adresse_nom_voie,adresse_code_voie,code_postal,code_commune,nom_commune,code_departement,ancien_code_commune,ancien_nom_commune,id_parcelle,ancien_id_parcelle,numero_volume,lot1_numero,lot1_surface_carrez,lot2_numero,lot2_surface_carrez,lot3_numero,lot3_surface_carrez,lot4_numero,lot4_surface_carrez,lot5_numero,lot5_surface_carrez,nombre_lots,code_type_local,type_local,surface_reelle_bati,nombre_pieces_principales,code_nature_culture,nature_culture,code_nature_culture_speciale,nature_culture_speciale,surface_terrain,longitude,latitude
2019-908724,2019-01-19,000001,Vente,14000,,,LE VILLAGE SUD,B041,62159,62839,Vaulx-Vraucourt,62,,,62839000AD0067,,,,,,,,,,,,,0,,,,,J,jardins,,,446,2.906159,50.14452
2019-908724,2019-01-19,000001,Vente,14000,,,RUE DE FREMICOURT,0360,62159,62839,Vaulx-Vraucourt,62,,,62839000AD0068,,,,,,,,,,,,,0,,,,,T,terres,,,182,2.906319,50.144478
2019-909067,2019-02-01,000001,Vente,35000,6,B,RUE DU FBG DE PARIS,0340,62159,62839,Vaulx-Vraucourt,62,,,62839000AD0329,,,,,,,,,,,,,0,4,Local industriel. commercial ou assimilé,148,0,S,sols,,,865,2.909422,50.145283
2019-909232,2019-02-25,000001,Vente,145000,10,,RUE DES HAIES,0388,62159,62839,Vaulx-Vraucourt,62,,,62839000AB0296,,,,,,,,,,,,,0,1,Maison,90,5,S,sols,,,1035,2.901573,50.151441
2019-909888,2019-04-10,000001,Vente,65000,48,,GR GRAND RUE,0385,62159,62839,Vaulx-Vraucourt,62,,,62839000AB0034,,,,,,,,,,,,,0,1,Maison,56,3,S,sols,,,711,2.904414,50.151812
2019-910150,2019-04-30,000001,Vente,114000,,,LE VILLAGE SUD,B041,62159,62839,Vaulx-Vraucourt,62,,,62839000AD0182,,,,,,,,,,,,,0,,,,,S,sols,,,117,2.906788,50.141571
2019-910150,2019-04-30,000001,Vente,114000,3,,RUE DU PAS D ANE,0640,62159,62839,Vaulx-Vraucourt,62,,,62839000AD0292,,,,,,,,,,,,,0,1,Maison,124,4,S,sols,,,1008,2.90664,50.141396
2019-910150,2019-04-30,000001,Vente,114000,,,LE VILLAGE SUD,B041,62159,62839,Vaulx-Vraucourt,62,,,62839000AD0293,,,,,,,,,,,,,0,,,,,S,sols,,,59,2.906752,50.141353
2019-910151,2019-04-30,000001,Vente,56000,51,,GR GRAND RUE,0385,62159,62839,Vaulx-Vraucourt,62,,,62839000AB0094,,,,,,,,,,,,,0,1,Maison,64,3,S,sols,,,411,2.902013,50.151816
2019-910151,2019-04-30,000001,Vente,56000,,,LE VILLAGE NORD,B040,62159,62839,Vaulx-Vraucourt,62,,,62839000AB0231,,,,,,,,,,,,,0,,,,,J,jardins,,,293,2.902149,50.1518
2019-910170,2019-04-25,000001,Vente,67500,1,,RUE DE L EGLISE,0280,62159,62839,Vaulx-Vraucourt,62,,,62839000AC0349,,,,,,,,,,,,,0,1,Maison,140,6,S,sols,,,264,2.910479,50.148186
2019-910337,2019-05-10,000001,Vente,7875,,,LE MOULIN GILLION,B027,62159,62839,Vaulx-Vraucourt,62,,,62839000ZD0038,,,,,,,,,,,,,0,,,,,T,terres,,,10430,2.920868,50.155185
2019-910411,2019-05-20,000001,Vente,55000,32,,RUE DU FBG DE PARIS,0340,62159,62839,Vaulx-Vraucourt,62,,,62839000AD0180,,,,,,,,,,,,,0,1,Maison,90,4,S,sols,,,865,2.907124,50.141634
2019-910411,2019-05-20,000001,Vente,55000,,,LE VILLAGE SUD,B041,62159,62839,Vaulx-Vraucourt,62,,,62839000AD0181,,,,,,,,,,,,,0,,,,,J,jardins,,,735,2.906614,50.141757
2019-910411,2019-05-20,000001,Vente,55000,,,RUE DU PAS D ANE,0640,62159,62839,Vaulx-Vraucourt,62,,,62839000AD0290,,,,,,,,,,,,,0,,,,,S,sols,,,53,2.906912,50.141502
2019-910411,2019-05-20,000001,Vente,55000,,,RUE DU PAS D ANE,0640,62159,62839,Vaulx-Vraucourt,62,,,62839000AD0291,,,,,,,,,,,,,0,,,,,S,sols,,,6,2.906686,50.141203
2019-910411,2019-05-20,000001,Vente,55000,,,LE VILLAGE SUD,B041,62159,62839,Vaulx-Vraucourt,62,,,62839000AD0294,,,,,,,,,,,,,0,,,,,L,landes,,,1306,2.906819,50.141288
2019-910528,2019-06-05,000001,Vente,41862.6,,,LA CHAPELLE BERGER,B006,62159,62839,Vaulx-Vraucourt,62,,,62839000ZP0007,,,,,,,,,,,,,0,,,,,T,terres,,,11630,2.886664,50.160077
2019-910528,2019-06-05,000001,Vente,41862.6,,,LA CHAPELLE BERGER,B006,62159,62839,Vaulx-Vraucourt,62,,,62839000ZP0007,,,,,,,,,,,,,0,,,,,T,terres,,,11627,2.886664,50.160077
2019-910667,2019-06-07,000001,Vente,135000,37,,GR GRAND RUE,0385,62159,62839,Vaulx-Vraucourt,62,,,62839000AB0111,,,,,,,,,,,,,0,1,Maison,115,4,S,sols,,,314,2.903742,50.151546
2019-910667,2019-06-07,000001,Vente,135000,,,LE VILLAGE NORD,B040,62159,62839,Vaulx-Vraucourt,62,,,62839000AB0388,,,,,,,,,,,,,0,,,,,J,jardins,,,791,2.903581,50.151342
2019-910795,2019-06-20,000001,Vente,131590,,,ENTRE VOIE MORY ET CHEM DO,B018,62159,62839,Vaulx-Vraucourt,62,,,62839000ZA0002,,,,,,,,,,,,,0,,,,,T,terres,,,22650,2.876502,50.146353
2019-910795,2019-06-20,000001,Vente,131590,,,ENTRE VOIE MORY ET CHEM DO,B018,62159,62839,Vaulx-Vraucourt,62,,,62839000ZA0003,,,,,,,,,,,,,0,,,,,T,terres,,,5110,2.877151,50.146685
2019-910795,2019-06-20,000001,Vente,131590,,,ENTRE VOIE MORY ET CHEM DO,B018,62159,62839,Vaulx-Vraucourt,62,,,62839000ZA0053,,,,,,,,,,,,,0,,,,,T,terres,,,35919,2.87489,50.146652
2019-911009,2019-07-02,000001,Vente,123000,15,,RUE DE FREMICOURT,0360,62159,62839,Vaulx-Vraucourt,62,,,62839000AD0114,,,,,,,,,,,,,0,1,Maison,108,5,S,sols,,,607,2.90694,50.144823
2019-911571,2019-07-26,000001,Echange,1000,,,GR GRAND RUE,0385,62159,62839,Vaulx-Vraucourt,62,,,62839000AB0465,,,,,,,,,,,,,0,,,,,S,sols,,,9,2.902449,50.152374
2019-911571,2019-07-26,000002,Echange,1000,,,GR GRAND RUE,0385,62159,62839,Vaulx-Vraucourt,62,,,62839000AB0468,,,,,,,,,,,,,0,,,,,S,sols,,,49,2.902315,50.152504
2019-911582,2019-07-26,000001,Vente,40000,,,LE VILLAGE NORD,B040,62159,62839,Vaulx-Vraucourt,62,,,62839000AB0463,,,,,,,,,,,,,0,,,,,J,jardins,,,17,2.902468,50.152238
2019-911582,2019-07-26,000001,Vente,40000,,,GR GRAND RUE,0385,62159,62839,Vaulx-Vraucourt,62,,,62839000AB0470,,,,,,,,,,,,,0,,,,,S,sols,,,496,2.902677,50.152233
2019-911608,2019-08-30,000001,Vente,295000,,,RUE D ECOUST SAINT MEIN,0260,62159,62839,Vaulx-Vraucourt,62,,,62839000AB0454,,,,,,,,,,,,,0,,,,,J,jardins,,,1851,2.900151,50.154424
2019-911608,2019-08-30,000001,Vente,295000,,,RUE D ECOUST SAINT MEIN,0260,62159,62839,Vaulx-Vraucourt,62,,,62839000AB0455,,,,,,,,,,,,,0,,,,,J,jardins,,,403,2.900352,50.154988
2019-911608,2019-08-30,000001,Vente,295000,,,RUE D ECOUST SAINT MEIN,0260,62159,62839,Vaulx-Vraucourt,62,,,62839000AB0456,,,,,,,,,,,,,0,,,,,J,jardins,,,385,2.900448,50.155154
2019-911608,2019-08-30,000001,Vente,295000,18,,RUE DE LA CHAPELLE,0185,62159,62839,Vaulx-Vraucourt,62,,,62839000AB0459,,,,,,,,,,,,,0,1,Maison,226,8,S,sols,,,3309,2.900299,50.154324
2019-911623,2019-09-05,000001,Vente,151820,,,LE VILLAGE SUD,B041,62159,62839,Vaulx-Vraucourt,62,,,62839000AD0095,,,,,,,,,,,,,0,,,,,J,jardins,,,296,2.906821,50.145813
2019-911623,2019-09-05,000001,Vente,151820,2,,RUE BELLOTTE,0120,62159,62839,Vaulx-Vraucourt,62,,,62839000AD0096,,,,,,,,,,,,,0,1,Maison,136,5,S,sols,,,137,2.90697,50.145761
2019-911623,2019-09-05,000001,Vente,151820,,,LE VILLAGE SUD,B041,62159,62839,Vaulx-Vraucourt,62,,,62839000AD0097,,,,,,,,,,,,,0,,,,,J,jardins,,,484,2.907153,50.145687
2019-911623,2019-09-05,000001,Vente,151820,,,LE VILLAGE SUD,B041,62159,62839,Vaulx-Vraucourt,62,,,62839000AD0097,,,,,,,,,,,,,0,,,,,S,sols,,,42,2.907153,50.145687
2019-911958,2019-09-20,000001,Vente,80000,16,B,RUE DE LA CHAPELLE,0185,62159,62839,Vaulx-Vraucourt,62,,,62839000AB0010,,,,,,,,,,,,,0,4,Local industriel. commercial ou assimilé,570,0,S,sols,,,560,2.902676,50.154004
2019-911958,2019-09-20,000001,Vente,80000,16,B,RUE DE LA CHAPELLE,0185,62159,62839,Vaulx-Vraucourt,62,,,62839000AB0010,,,,,,,,,,,,,0,4,Local industriel. commercial ou assimilé,570,0,J,jardins,,,4395,2.902676,50.154004
2019-912730,2019-11-26,000001,Vente,140000,7,,RUE DE L EGLISE,0280,62159,62839,Vaulx-Vraucourt,62,,,62839000AC0111,,,,,,,,,,,,,0,1,Maison,200,8,S,sols,,,1198,2.910098,50.147383
2019-912730,2019-11-26,000001,Vente,140000,,,LE VILLAGE EST,B039,62159,62839,Vaulx-Vraucourt,62,,,62839000AC0290,,,,,,,,,,,,,0,,,,,J,jardins,,,1054,2.910608,50.147258
2019-912834,2019-12-06,000001,Vente,11796,,,RTE DE DOUAI,0220,62159,62839,Vaulx-Vraucourt,62,,,62839000ZK0033,,,,,,,,,,,,,0,,,,,T,terres,,,2459,2.906279,50.139623
2019-912834,2019-12-06,000001,Vente,11796,,,RTE DE DOUAI,0220,62159,62839,Vaulx-Vraucourt,62,,,62839000ZK0033,,,,,,,,,,,,,0,,,,,T,terres,,,7371,2.906279,50.139623
2019-913144,2019-12-19,000001,Vente,130000,8,,GR GRAND RUE,0385,62159,62839,Vaulx-Vraucourt,62,,,62839000AC0293,,,,,,,,,,,,,0,1,Maison,150,7,S,sols,,,2105,2.90945,50.148743
2019-913146,2019-12-20,000001,Vente,90000,,,IMP DES BLEUETS,0150,62159,62839,Vaulx-Vraucourt,62,,,62839000AB0188,,,,,,,,,,,,,0,,,,,J,jardins,,,206,2.908074,50.150343
2019-913146,2019-12-20,000001,Vente,90000,3,,IMP DES BLEUETS,0150,62159,62839,Vaulx-Vraucourt,62,,,62839000AB0190,,,,,,,,,,,,,0,1,Maison,93,4,S,sols,,,255,2.907736,50.150098
