id_mutation,date_mutation,numero_disposition,nature_mutation,valeur_fonciere,adresse_numero,adresse_suffixe,adresse_nom_voie,adresse_code_voie,code_postal,code_commune,nom_commune,code_departement,ancien_code_commune,ancien_nom_commune,id_parcelle,ancien_id_parcelle,numero_volume,lot1_numero,lot1_surface_carrez,lot2_numero,lot2_surface_carrez,lot3_numero,lot3_surface_carrez,lot4_numero,lot4_surface_carrez,lot5_numero,lot5_surface_carrez,nombre_lots,code_type_local,type_local,surface_reelle_bati,nombre_pieces_principales,code_nature_culture,nature_culture,code_nature_culture_speciale,nature_culture_speciale,surface_terrain,longitude,latitude
2019-948808,2019-01-22,000001,Vente,131000,,,LES CHAMPS,B017,63660,63104,La Chaulme,63,,,631040000A0097,,,,,,,,,,,,,0,,,,,BR,futaies résineuses,,,4370,3.939754,45.475305
2019-948808,2019-01-22,000001,Vente,131000,5210,,LES CHAMPS,B017,63660,63104,La Chaulme,63,,,631040000A1396,,,,,,,,,,,,,0,1,Maison,80,5,S,sols,,,1000,3.940538,45.474538
2019-948808,2019-01-22,000001,Vente,131000,5210,,LES CHAMPS,B017,63660,63104,La Chaulme,63,,,631040000A1396,,,,,,,,,,,,,0,1,Maison,80,5,P,prés,,,1210,3.940538,45.474538
2019-948808,2019-01-22,000001,Vente,131000,5210,,LES CHAMPS,B017,63660,63104,La Chaulme,63,,,631040000A1396,,,,,,,,,,,,,0,1,Maison,80,5,T,terres,,,1160,3.940538,45.474538
2019-948834,2019-01-22,000001,Vente,1800,,,LA LITTE,B088,63660,63104,La Chaulme,63,,,631040000A0093,,,,,,,,,,,,,0,,,,,BR,futaies résineuses,,,7730,3.937268,45.474874
2019-949003,2019-02-20,000001,Vente,16000,,,LE BOIS DU ROI DE MALVEILL,B006,63660,63104,La Chaulme,63,,,631040000A1199,,,,,,,,,,,,,0,,,,,BF,futaies feuillues,,,11743,3.958799,45.483663
2019-949003,2019-02-20,000001,Vente,16000,,,LE BOIS DU ROI DE MALVEILL,B006,63660,63104,La Chaulme,63,,,631040000A1199,,,,,,,,,,,,,0,,,,,BR,futaies résineuses,,,11744,3.958799,45.483663
2019-949298,2019-03-18,000001,Vente,1802,,,LE PETIT CLOS,B113,63660,63104,La Chaulme,63,,,631040000A0451,,,,,,,,,,,,,0,,,,,P,prés,,,305,3.956033,45.469718
2019-949298,2019-03-18,000001,Vente,1802,,,CHAMP GRAND,B015,63660,63104,La Chaulme,63,,,631040000B0534,,,,,,,,,,,,,0,,,,,BR,futaies résineuses,,,2495,3.980424,45.48453
2019-949298,2019-03-18,000001,Vente,1802,,,CHAMP GRAND,B015,63660,63104,La Chaulme,63,,,631040000B0535,,,,,,,,,,,,,0,,,,,BR,futaies résineuses,,,165,3.980127,45.484247
2019-949298,2019-03-18,000001,Vente,1802,,,LES CHEIRES,B025,63660,63104,La Chaulme,63,,,631040000C0482,,,,,,,,,,,,,0,,,,,BR,futaies résineuses,,,4450,3.944185,45.452439
2019-949298,2019-03-18,000001,Vente,1802,,,LES CHEIRES,B025,63660,63104,La Chaulme,63,,,631040000C0497,,,,,,,,,,,,,0,,,,,BR,futaies résineuses,,,2880,3.940176,45.453313
2019-949393,2019-04-16,000001,Vente,2850,,,LA SAGNOL,B145,63660,63104,La Chaulme,63,,,631040000B0030,,,,,,,,,,,,,0,,,,,BF,futaies feuillues,,,7560,3.976569,45.497016
2019-949395,2019-04-03,000001,Vente,274500,,,PELARDY,B111,63660,63104,La Chaulme,63,,,631040000B0558,,,,,,,,,,,,,0,,,,,P,prés,,,1445,3.977891,45.481009
2019-949395,2019-04-03,000001,Vente,274500,,,PELARDY,B111,63660,63104,La Chaulme,63,,,631040000B0558,,,,,,,,,,,,,0,,,,,P,prés,,,945,3.977891,45.481009
2019-949395,2019-04-03,000001,Vente,274500,5085,,PELARDY,B111,63660,63104,La Chaulme,63,,,631040000B0559,,,,,,,,,,,,,0,1,Maison,100,4,S,sols,,,1270,3.977722,45.480984
2019-949559,2019-04-27,000001,Vente,8000,,,LE DEVAY,B054,63660,63104,La Chaulme,63,,,631040000B0047,,,,,,,,,,,,,0,,,,,PA,pâtures,,,6360,3.966799,45.491695
2019-949939,2019-06-12,000001,Vente,570,,,MONTAUX,B102,63660,63104,La Chaulme,63,,,631040000C1209,,,,,,,,,,,,,0,,,,,S,sols,,,228,3.971834,45.448783
2019-950019,2019-05-17,000001,Vente,126500,,,LE BOIS DU ROI DE MALVEILL,B006,63660,63104,La Chaulme,63,,,631040000A1201,,,,,,,,,,,,,0,,,,,BF,futaies feuillues,,,7916,3.96061,45.482108
2019-950019,2019-05-17,000001,Vente,126500,,,LE BOIS DU ROI DE MALVEILL,B006,63660,63104,La Chaulme,63,,,631040000A1201,,,,,,,,,,,,,0,,,,,BR,futaies résineuses,,,23748,3.96061,45.482108
2019-950019,2019-05-17,000001,Vente,126500,,,LE BOIS DE LA CHAULME,B005,63660,63104,La Chaulme,63,,,631040000C0938,,,,,,,,,,,,,0,,,,,B,bois,,,26697,3.965295,45.4584
2019-950019,2019-05-17,000001,Vente,126500,,,LE BOIS DE LA CHAULME,B005,63660,63104,La Chaulme,63,,,631040000C0938,,,,,,,,,,,,,0,,,,,BR,futaies résineuses,,,17799,3.965295,45.4584
2019-950019,2019-05-17,000001,Vente,126500,,,LE BOIS DE LA CHAULME,B005,63660,63104,La Chaulme,63,,,631040000C0941,,,,,,,,,,,,,0,,,,,B,bois,,,25935,3.965491,45.460473
2019-950019,2019-05-17,000001,Vente,126500,,,LE BOIS DE LA CHAULME,B005,63660,63104,La Chaulme,63,,,631040000C0941,,,,,,,,,,,,,0,,,,,BR,futaies résineuses,,,17290,3.965491,45.460473
2019-950019,2019-05-17,000001,Vente,126500,,,LE BOIS DE LA CHAULME,B005,63660,63104,La Chaulme,63,,,631040000C0953,,,,,,,,,,,,,0,,,,,BR,futaies résineuses,,,10377,3.966324,45.466606
2019-950019,2019-05-17,000001,Vente,126500,,,LE BOIS DE LA CHAULME,B005,63660,63104,La Chaulme,63,,,631040000C0954,,,,,,,,,,,,,0,,,,,BR,futaies résineuses,,,9831,3.965788,45.467163
2019-950216,2019-07-23,000001,Vente,168000,,,MALVEILLE,B091,63660,63104,La Chaulme,63,,,631040000A1029,,,,,,,,,,,,,0,,,,,BF,futaies feuillues,,,40220,3.957198,45.480435
2019-950216,2019-07-23,000001,Vente,168000,,,MALVEILLE,B091,63660,63104,La Chaulme,63,,,631040000A1029,,,,,,,,,,,,,0,,,,,BR,futaies résineuses,,,40220,3.957198,45.480435
2019-950216,2019-07-23,000001,Vente,168000,,,MALVEILLE,B091,63660,63104,La Chaulme,63,,,631040000A1030,,,,,,,,,,,,,0,,,,,BF,futaies feuillues,,,53950,3.955549,45.47801
2019-950216,2019-07-23,000001,Vente,168000,,,MALVEILLE,B091,63660,63104,La Chaulme,63,,,631040000A1030,,,,,,,,,,,,,0,,,,,BR,futaies résineuses,,,53950,3.955549,45.47801
2019-950461,2019-08-09,000002,Vente,175000,,,LES RIBEYRES,B130,63660,63104,La Chaulme,63,,,631040000C0274,,,,,,,,,,,,,0,,,,,T,terres,,,1755,3.954918,45.465768
2019-950461,2019-08-09,000002,Vente,175000,5102,,LES RIBEYRES,B130,63660,63104,La Chaulme,63,,,631040000C1170,,,,,,,,,,,,,0,1,Maison,76,4,S,sols,,,31,3.954848,45.465945
2019-950461,2019-08-09,000002,Vente,175000,,,LES RIBEYRES,B130,63660,63104,La Chaulme,63,,,631040000C1171,,,,,,,,,,,,,0,,,,,S,sols,,,123,3.954938,45.46598
2019-950461,2019-08-09,000002,Vente,175000,,,LES RIBEYRES,B130,63660,63104,La Chaulme,63,,,631040000C1172,,,,,,,,,,,,,0,,,,,S,sols,,,156,3.954838,45.466015
2019-950461,2019-08-09,000002,Vente,175000,,,LES RIBEYRES,B130,63660,63104,La Chaulme,63,,,631040000C1173,,,,,,,,,,,,,0,,,,,S,sols,,,480,3.954906,45.465955
2019-950461,2019-08-09,000002,Vente,175000,,,LES RIBEYRES,B130,63660,63104,La Chaulme,63,,,631040000C1210,,,,,,,,,,,,,0,,,,,P,prés,,,1617,3.954679,45.466016
2019-951211,2019-11-14,000001,Vente,2000,,,LES BESSEYRES,B004,63660,63104,La Chaulme,63,,,631040000B0132,,,,,,,,,,,,,0,,,,,BR,futaies résineuses,,,4290,3.980958,45.49416
2019-951211,2019-11-14,000001,Vente,2000,,,LES BESSEYRES,B004,63660,63104,La Chaulme,63,,,631040000B0133,,,,,,,,,,,,,0,,,,,BR,futaies résineuses,,,1635,3.981001,45.493981
2019-951211,2019-11-14,000001,Vente,2000,,,LES GUELLES,B083,63660,63104,La Chaulme,63,,,631040000B0519,,,,,,,,,,,,,0,,,,,BR,futaies résineuses,,,1015,3.982068,45.485617
2019-951346,2019-12-16,000001,Vente,85000,,,MONTCHOUVET,B103,63660,63104,La Chaulme,63,,,631040000B0628,,,,,,,,,,,,,0,,,,,J,jardins,,,340,3.97183,45.479198
2019-951346,2019-12-16,000001,Vente,85000,,,MONTCHOUVET,B103,63660,63104,La Chaulme,63,,,631040000B0629,,,,,,,,,,,,,0,,,,,P,prés,,,380,3.972062,45.479277
2019-951346,2019-12-16,000001,Vente,85000,5090,,MONTCHOUVET,B103,63660,63104,La Chaulme,63,,,631040000B0633,,,,,,,,,,,,,0,1,Maison,150,3,S,sols,,,240,3.971613,45.479354
2019-951432,2019-12-23,000001,Vente,97400,,,RIVET,B136,63660,63104,La Chaulme,63,,,631040000C0072,,,,,,,,,,,,,0,,,,,P,prés,,,9514,3.941811,45.466856
2019-951432,2019-12-23,000001,Vente,97400,,,RIVET,B136,63660,63104,La Chaulme,63,,,631040000C0072,,,,,,,,,,,,,0,,,,,P,prés,,,4756,3.941811,45.466856
2019-951432,2019-12-23,000001,Vente,97400,5015,,LA MARICHE,B096,63660,63104,La Chaulme,63,,,631040000C0073,,,,,,,,,,,,,0,1,Maison,100,1,S,sols,,,390,3.942752,45.467077
