id_mutation,date_mutation,numero_disposition,nature_mutation,valeur_fonciere,adresse_numero,adresse_suffixe,adresse_nom_voie,adresse_code_voie,code_postal,code_commune,nom_commune,code_departement,ancien_code_commune,ancien_nom_commune,id_parcelle,ancien_id_parcelle,numero_volume,lot1_numero,lot1_surface_carrez,lot2_numero,lot2_surface_carrez,lot3_numero,lot3_surface_carrez,lot4_numero,lot4_surface_carrez,lot5_numero,lot5_surface_carrez,nombre_lots,code_type_local,type_local,surface_reelle_bati,nombre_pieces_principales,code_nature_culture,nature_culture,code_nature_culture_speciale,nature_culture_speciale,surface_terrain,longitude,latitude
2019-945394,2019-01-28,000001,Vente,14000,,,LES FROMENTAUX,B098,63380,63115,Combrailles,63,,,63115000AW0107,,,,,,,,,,,,,0,,,,,P,prés,,,54020,2.639742,45.844345
2019-945449,2019-01-18,000001,Vente,5000,,,VAL,B196,63380,63115,Combrailles,63,,,63115000ZB0058,,,,,,,,,,,,,0,,,,,P,prés,,,5345,2.640866,45.853685
2019-946424,2019-05-15,000001,Vente,12000,5138,,LE TRIADOUX,B193,63380,63115,Combrailles,63,,,63115000AV0103,,,,,,,,,,,,,0,1,Maison,21,1,S,sols,,,500,2.623497,45.835761
2019-946424,2019-05-15,000001,Vente,12000,5138,,LE TRIADOUX,B193,63380,63115,Combrailles,63,,,63115000AV0103,,,,,,,,,,,,,0,1,Maison,21,1,AG,terrains d'agrément,,,1750,2.623497,45.835761
2019-946424,2019-05-15,000001,Vente,12000,5116,,LE TRIADOUX,B193,63380,63115,Combrailles,63,,,63115000AV0104,,,,,,,,,,,,,0,1,Maison,28,1,S,sols,,,44,2.6236,45.836035
2019-946424,2019-05-15,000001,Vente,12000,,,LE TRIADOUX,B193,63380,63115,Combrailles,63,,,63115000AV0105,,,,,,,,,,,,,0,,,,,J,jardins,,,259,2.623354,45.835996
2019-946424,2019-05-15,000001,Vente,12000,,,LE TRIADOUX,B193,63380,63115,Combrailles,63,,,63115000AV0106,,,,,,,,,,,,,0,,,,,J,jardins,,,239,2.623075,45.835796
2019-946424,2019-05-15,000001,Vente,12000,,,LE TRIADOUX,B193,63380,63115,Combrailles,63,,,63115000AV0192,,,,,,,,,,,,,0,,,,,P,prés,,,590,2.623148,45.835955
2019-947213,2019-08-01,000001,Vente,10000,,,ROUVAILLE,B172,63380,63115,Combrailles,63,,,63115000AT0088,,,,,,,,,,,,,0,,,,,E,eaux,ETANG,Etangs,2399,2.62539,45.830491
2019-947213,2019-08-01,000001,Vente,10000,,,ROUVAILLE,B172,63380,63115,Combrailles,63,,,63115000AT0088,,,,,,,,,,,,,0,,,,,PA,pâtures,,,6041,2.62539,45.830491
2019-947214,2019-08-01,000002,Vente,56000,,,LE TRIADOUX,B193,63380,63115,Combrailles,63,,,63115000AT0072,,,,,,,,,,,,,0,,,,,S,sols,,,24,2.6236,45.831552
2019-947214,2019-08-01,000002,Vente,56000,,,LE TRIADOUX,B193,63380,63115,Combrailles,63,,,63115000AT0072,,,,,,,,,,,,,0,,,,,J,jardins,,,364,2.6236,45.831552
2019-947214,2019-08-01,000002,Vente,56000,5048,,LE TRIADOUX,B193,63380,63115,Combrailles,63,,,63115000AT0073,,,,,,,,,,,,,0,1,Maison,90,4,S,sols,,,556,2.623772,45.831692
2019-947214,2019-08-01,000002,Vente,56000,,,ROUVAILLE,B172,63380,63115,Combrailles,63,,,63115000AT0089,,,,,,,,,,,,,0,,,,,E,eaux,ETANG,Etangs,1733,2.624513,45.831046
2019-947214,2019-08-01,000002,Vente,56000,,,ROUVAILLE,B172,63380,63115,Combrailles,63,,,63115000AT0089,,,,,,,,,,,,,0,,,,,P,prés,,,7634,2.624513,45.831046
2019-947214,2019-08-01,000002,Vente,56000,,,ROUVAILLE,B172,63380,63115,Combrailles,63,,,63115000AT0089,,,,,,,,,,,,,0,,,,,P,prés,,,7633,2.624513,45.831046
2019-947214,2019-08-01,000002,Vente,56000,,,ROUVAILLE,B172,63380,63115,Combrailles,63,,,63115000AT0090,,,,,,,,,,,,,0,,,,,PA,pâtures,,,1520,2.623568,45.83083
2019-947895,2019-10-15,000001,Vente,38500,,,LE GRENIER,B113,63380,63115,Combrailles,63,,,63115000AT0051,,,,,,,,,,,,,0,,,,,P,prés,,,3700,2.618929,45.834545
2019-947895,2019-10-15,000001,Vente,38500,,,LE GRENIER,B113,63380,63115,Combrailles,63,,,63115000AT0051,,,,,,,,,,,,,0,,,,,P,prés,,,3700,2.618929,45.834545
2019-947895,2019-10-15,000001,Vente,38500,5055,,LE GRENIER,B113,63380,63115,Combrailles,63,,,63115000AT0142,,,,,,,,,,,,,0,1,Maison,76,3,S,sols,,,899,2.618496,45.83533
2019-947895,2019-10-15,000001,Vente,38500,,,LE GRENIER,B113,63380,63115,Combrailles,63,,,63115000AT0145,,,,,,,,,,,,,0,,,,,P,prés,,,54,2.618713,45.835362
2019-947895,2019-10-15,000001,Vente,38500,,,LE GRENIER,B113,63380,63115,Combrailles,63,,,63115000AV0144,,,,,,,,,,,,,0,,,,,J,jardins,,,195,2.618355,45.83572
2019-948548,2019-12-27,000001,Vente,110080,,,CHAPUZAT,B042,63380,63115,Combrailles,63,,,63115000AO0065,,,,,,,,,,,,,0,,,,,P,prés,,,800,2.636113,45.828224
2019-948548,2019-12-27,000001,Vente,110080,,,CHAPUZAT,B042,63380,63115,Combrailles,63,,,63115000AS0100,,,,,,,,,,,,,0,,,,,P,prés,,,640,2.636013,45.827805
2019-948548,2019-12-27,000001,Vente,110080,,,CHAPUZAT,B042,63380,63115,Combrailles,63,,,63115000AS0101,,,,,,,,,,,,,0,,,,,T,terres,,,2460,2.635981,45.827251
2019-948548,2019-12-27,000001,Vente,110080,5066,,CHAPUZAT,B042,63380,63115,Combrailles,63,,,63115000AS0102,,,,,,,,,,,,,0,1,Maison,98,4,S,sols,,,358,2.636174,45.827226
2019-948548,2019-12-27,000001,Vente,110080,,,CHAPUZAT,B042,63380,63115,Combrailles,63,,,63115000AS0103,,,,,,,,,,,,,0,,,,,S,sols,,,22,2.636376,45.827645
2019-948548,2019-12-27,000001,Vente,110080,,,CHAPUZAT,B042,63380,63115,Combrailles,63,,,63115000AS0104,,,,,,,,,,,,,0,,,,,S,sols,,,7,2.636278,45.827537
2019-948548,2019-12-27,000001,Vente,110080,,,CHAPUZAT,B042,63380,63115,Combrailles,63,,,63115000AS0104,,,,,,,,,,,,,0,,,,,T,terres,,,963,2.636278,45.827537
2019-948548,2019-12-27,000001,Vente,110080,,,CHAPUZAT,B042,63380,63115,Combrailles,63,,,63115000AS0140,,,,,,,,,,,,,0,,,,,S,sols,,,40,2.636299,45.827385
