id_mutation,date_mutation,numero_disposition,nature_mutation,valeur_fonciere,adresse_numero,adresse_suffixe,adresse_nom_voie,adresse_code_voie,code_postal,code_commune,nom_commune,code_departement,ancien_code_commune,ancien_nom_commune,id_parcelle,ancien_id_parcelle,numero_volume,lot1_numero,lot1_surface_carrez,lot2_numero,lot2_surface_carrez,lot3_numero,lot3_surface_carrez,lot4_numero,lot4_surface_carrez,lot5_numero,lot5_surface_carrez,nombre_lots,code_type_local,type_local,surface_reelle_bati,nombre_pieces_principales,code_nature_culture,nature_culture,code_nature_culture_speciale,nature_culture_speciale,surface_terrain,longitude,latitude
2019-948745,2019-01-04,000001,Vente,500,,,LE GRUN,B090,63300,63151,Escoutoux,63,,,63151000AN0242,,,,,,,,,,,,,0,,,,,BT,taillis simples,,,6535,3.578479,45.818337
2019-948791,2019-01-15,000001,Vente,2800,,,RUDEL,B154,63300,63151,Escoutoux,63,,,63151000AT0031,,,,,,,,,,,,,0,,,,,BR,futaies résineuses,PIN,Pins,759,3.567685,45.78819
2019-948791,2019-01-15,000001,Vente,2800,,,RUDEL,B154,63300,63151,Escoutoux,63,,,63151000AT0052,,,,,,,,,,,,,0,,,,,BS,taillis sous futaie,,,660,3.565803,45.790388
2019-948791,2019-01-15,000001,Vente,2800,,,LES BONNETS,B011,63300,63151,Escoutoux,63,,,63151000AT0174,,,,,,,,,,,,,0,,,,,BR,futaies résineuses,,,1274,3.572141,45.796127
2019-948791,2019-01-15,000001,Vente,2800,,,LES BONNETS,B011,63300,63151,Escoutoux,63,,,63151000AT0175,,,,,,,,,,,,,0,,,,,BS,taillis sous futaie,,,2034,3.573283,45.795913
2019-948791,2019-01-15,000001,Vente,2800,,,LES BONNETS,B011,63300,63151,Escoutoux,63,,,63151000AT0176,,,,,,,,,,,,,0,,,,,BS,taillis sous futaie,,,1570,3.572667,45.795792
2019-948791,2019-01-15,000001,Vente,2800,,,PAGNON,B115,63300,63151,Escoutoux,63,,,63151000AT0223,,,,,,,,,,,,,0,,,,,BT,taillis simples,,,1324,3.569989,45.79173
2019-948791,2019-01-15,000001,Vente,2800,,,PAGNON,B115,63300,63151,Escoutoux,63,,,63151000AT0230,,,,,,,,,,,,,0,,,,,BR,futaies résineuses,PIN,Pins,3517,3.569532,45.793281
2019-948791,2019-01-15,000001,Vente,2800,,,PAGNON,B115,63300,63151,Escoutoux,63,,,63151000AT0231,,,,,,,,,,,,,0,,,,,BR,futaies résineuses,PIN,Pins,4340,3.569904,45.7934
2019-948791,2019-01-15,000001,Vente,2800,,,PAGNON,B115,63300,63151,Escoutoux,63,,,63151000AT0260,,,,,,,,,,,,,0,,,,,BS,taillis sous futaie,,,2090,3.571023,45.790567
2019-948791,2019-01-15,000001,Vente,2800,,,PAGNON,B115,63300,63151,Escoutoux,63,,,63151000AT0262,,,,,,,,,,,,,0,,,,,VI,vignes,,,812,3.570339,45.791292
2019-948791,2019-01-15,000001,Vente,2800,,,PAGNON,B115,63300,63151,Escoutoux,63,,,63151000AT0263,,,,,,,,,,,,,0,,,,,BS,taillis sous futaie,,,7227,3.570349,45.791032
2019-948841,2019-01-30,000001,Vente,5000,,,MINA,B108,63300,63151,Escoutoux,63,,,63151000BD0145,,,,,,,,,,,,,0,,,,,T,terres,,,2618,3.544779,45.81625
2019-948841,2019-01-30,000001,Vente,5000,,,MINA,B108,63300,63151,Escoutoux,63,,,63151000BD0146,,,,,,,,,,,,,0,,,,,BT,taillis simples,,,1519,3.544129,45.815711
2019-948841,2019-01-30,000001,Vente,5000,,,PUY FARRAS,B138,63300,63151,Escoutoux,63,,,63151000BH0056,,,,,,,,,,,,,0,,,,,T,terres,,,2207,3.535299,45.81483
2019-948841,2019-01-30,000001,Vente,5000,,,PUY FARRAS,B138,63300,63151,Escoutoux,63,,,63151000BH0059,,,,,,,,,,,,,0,,,,,T,terres,,,10980,3.536694,45.814574
2019-948841,2019-01-30,000001,Vente,5000,,,REVEILLAS,B146,63300,63151,Escoutoux,63,,,63151000BH0081,,,,,,,,,,,,,0,,,,,BR,futaies résineuses,PIN,Pins,924,3.539328,45.813562
2019-948841,2019-01-30,000001,Vente,5000,,,REVEILLAS,B146,63300,63151,Escoutoux,63,,,63151000BH0082,,,,,,,,,,,,,0,,,,,P,prés,,,832,3.539449,45.813444
2019-948841,2019-01-30,000001,Vente,5000,,,REVEILLAS,B146,63300,63151,Escoutoux,63,,,63151000BH0083,,,,,,,,,,,,,0,,,,,BT,taillis simples,,,866,3.539712,45.813476
2019-948841,2019-01-30,000001,Vente,5000,,,REVEILLAS,B146,63300,63151,Escoutoux,63,,,63151000BH0084,,,,,,,,,,,,,0,,,,,P,prés,,,4960,3.539282,45.81317
2019-948841,2019-01-30,000001,Vente,5000,,,REVEILLAS,B146,63300,63151,Escoutoux,63,,,63151000BH0085,,,,,,,,,,,,,0,,,,,BT,taillis simples,,,1930,3.539015,45.812724
2019-949024,2019-01-29,000001,Vente,2600,,,MINA,B108,63300,63151,Escoutoux,63,,,63151000BD0153,,,,,,,,,,,,,0,,,,,PA,pâtures,,,3788,3.547053,45.814439
2019-949024,2019-01-29,000001,Vente,2600,,,LES PINS,B124,63300,63151,Escoutoux,63,,,63151000BD0328,,,,,,,,,,,,,0,,,,,BR,futaies résineuses,PIN,Pins,2937,3.534405,45.817503
2019-949024,2019-01-29,000001,Vente,2600,,,BUSSET,B020,63300,63151,Escoutoux,63,,,63151000BE0068,,,,,,,,,,,,,0,,,,,T,terres,,,1063,3.547174,45.813376
2019-949024,2019-01-29,000001,Vente,2600,,,BUSSET,B020,63300,63151,Escoutoux,63,,,63151000BE0070,,,,,,,,,,,,,0,,,,,T,terres,,,3829,3.547741,45.813665
2019-949024,2019-01-29,000001,Vente,2600,,,BUSSET,B020,63300,63151,Escoutoux,63,,,63151000BE0081,,,,,,,,,,,,,0,,,,,BR,futaies résineuses,PIN,Pins,5591,3.548545,45.814829
2019-949024,2019-01-29,000001,Vente,2600,,,BUSSET,B020,63300,63151,Escoutoux,63,,,63151000BE0082,,,,,,,,,,,,,0,,,,,VI,vignes,,,2397,3.547892,45.814835
2019-949024,2019-01-29,000001,Vente,2600,,,BUSSET,B020,63300,63151,Escoutoux,63,,,63151000BE0088,,,,,,,,,,,,,0,,,,,BR,futaies résineuses,PIN,Pins,2315,3.548902,45.816238
2019-949024,2019-01-29,000001,Vente,2600,,,BUSSET,B020,63300,63151,Escoutoux,63,,,63151000BE0089,,,,,,,,,,,,,0,,,,,BR,futaies résineuses,,,827,3.54913,45.816574
2019-949024,2019-01-29,000001,Vente,2600,,,BUSSET,B020,63300,63151,Escoutoux,63,,,63151000BE0091,,,,,,,,,,,,,0,,,,,BR,futaies résineuses,PIN,Pins,1117,3.549879,45.816133
2019-949024,2019-01-29,000001,Vente,2600,,,PUY FARRAS,B138,63300,63151,Escoutoux,63,,,63151000BH0031,,,,,,,,,,,,,0,,,,,L,landes,,,247,3.534344,45.815511
2019-949024,2019-01-29,000001,Vente,2600,,,PUY FARRAS,B138,63300,63151,Escoutoux,63,,,63151000BH0038,,,,,,,,,,,,,0,,,,,T,terres,,,861,3.533643,45.815083
2019-949296,2019-03-04,000001,Vente,55000,,,PIDOIRE,B123,63300,63151,Escoutoux,63,,,63151000AE0620,,,,,,,,,,,,,0,,,,,S,sols,,,15,3.549979,45.825996
2019-949296,2019-03-04,000001,Vente,55000,,,PIDOIRE,B123,63300,63151,Escoutoux,63,,,63151000AE0621,,,,,,,,,,,,,0,,,,,S,sols,,,24,3.550167,45.826004
2019-949296,2019-03-04,000001,Vente,55000,,,PIDOIRE,B123,63300,63151,Escoutoux,63,,,63151000AE0623,,,,,,,,,,,,,0,,,,,AB,terrains a bâtir,,,1097,3.550034,45.825713
2019-949296,2019-03-04,000001,Vente,55000,,,PIDOIRE,B123,63300,63151,Escoutoux,63,,,63151000AE0624,,,,,,,,,,,,,0,,,,,AB,terrains a bâtir,,,877,3.55015,45.825913
2019-949453,2019-04-04,000001,Vente,200,,,LA BENETIE,B004,63300,63151,Escoutoux,63,,,63151000AN0223,,,,,,,,,,,,,0,,,,,S,sols,,,82,3.58104,45.815645
2019-949515,2019-04-08,000001,Vente,251700,23,,CHE DE LAMOUROUX,0075,63300,63151,Escoutoux,63,,,63151000AE0493,,,,,,,,,,,,,0,1,Maison,117,4,J,jardins,,,700,3.548861,45.82952
2019-949515,2019-04-08,000001,Vente,251700,23,,CHE DE LAMOUROUX,0075,63300,63151,Escoutoux,63,,,63151000AE0493,,,,,,,,,,,,,0,1,Maison,117,4,S,sols,,,800,3.548861,45.82952
2019-949579,2019-05-10,000001,Vente,15000,,,RABISSAY,B141,63300,63151,Escoutoux,63,,,63151000AI0236,,,,,,,,,,,,,0,,,,,PA,pâtures,,,2650,3.580593,45.835324
2019-949579,2019-05-10,000001,Vente,15000,,,CROIX DE FER,B054,63300,63151,Escoutoux,63,,,63151000AL0143,,,,,,,,,,,,,0,,,,,BR,futaies résineuses,,,11109,3.583466,45.829673
2019-949580,2019-05-10,000001,Vente,1000,,,CROIX DE FER,B054,63300,63151,Escoutoux,63,,,63151000AL0142,,,,,,,,,,,,,0,,,,,BR,futaies résineuses,,,9341,3.582392,45.829972
2019-949676,2019-05-02,000002,Vente,14000,,,LES VERGNERES,B172,63300,63151,Escoutoux,63,,,63151000AD0613,,,,,,,,,,,,,0,,,,,AG,terrains d'agrément,,,192,3.53553,45.836609
2019-949676,2019-05-02,000002,Vente,14000,,,LES VERGNERES,B172,63300,63151,Escoutoux,63,,,63151000AD0620,,,,,,,,,,,,,0,,,,,L,landes,,,279,3.534783,45.836719
2019-949677,2019-05-02,000003,Vente,12000,,,LES VERGNERES,B172,63300,63151,Escoutoux,63,,,63151000AD0611,,,,,,,,,,,,,0,,,,,AB,terrains a bâtir,,,166,3.535678,45.83641
2019-949677,2019-05-02,000003,Vente,12000,,,LES VERGNERES,B172,63300,63151,Escoutoux,63,,,63151000AD0620,,,,,,,,,,,,,0,,,,,L,landes,,,279,3.534783,45.836719
2019-949740,2019-05-20,000001,Vente,3500,,,LES GARENNES,B074,63300,63151,Escoutoux,63,,,63151000AC0026,,,,,,,,,,,,,0,,,,,P,prés,,,12090,3.523085,45.835345
2019-949792,2019-05-22,000001,Vente,65000,,,ESCOUTOUX,B061,63300,63151,Escoutoux,63,,,63151000AO0336,,,,,,,,,,,,,0,,,,,BR,futaies résineuses,,,3238,3.565375,45.819032
2019-949792,2019-05-22,000001,Vente,65000,,,ESCOUTOUX,B061,63300,63151,Escoutoux,63,,,63151000AO0336,,,,,,,,,,,,,0,,,,,AB,terrains a bâtir,,,2657,3.565375,45.819032
2019-949831,2019-05-29,000001,Vente,500,,,TRUCHEVENT,B168,63300,63151,Escoutoux,63,,,63151000AN0268,,,,,,,,,,,,,0,,,,,BT,taillis simples,,,709,3.571186,45.819236
2019-949841,2019-05-27,000001,Vente,15000,,,CHAMPAUMONT,B028,63300,63151,Escoutoux,63,,,63151000AL0137,,,,,,,,,,,,,0,,,,,P,prés,,,4902,3.587805,45.82673
2019-949911,2019-06-07,000001,Vente,7600,,,LES PLANCHETTES,B127,63300,63151,Escoutoux,63,,,63151000AY0023,,,,,,,,,,,,,0,,,,,T,terres,,,1169,3.53575,45.795611
2019-949911,2019-06-07,000001,Vente,7600,,,LES PLANCHETTES,B127,63300,63151,Escoutoux,63,,,63151000AY0175,,,,,,,,,,,,,0,,,,,T,terres,,,31591,3.536776,45.796265
2019-949911,2019-06-07,000001,Vente,7600,,,LES PLANCHETTES,B127,63300,63151,Escoutoux,63,,,63151000AY0176,,,,,,,,,,,,,0,,,,,T,terres,,,664,3.536068,45.79571
2019-949911,2019-06-07,000001,Vente,7600,,,LES PLANCHETTES,B127,63300,63151,Escoutoux,63,,,63151000AY0177,,,,,,,,,,,,,0,,,,,T,terres,,,664,3.536657,45.795318
2019-949911,2019-06-07,000001,Vente,7600,,,LES PLANCHETTES,B127,63300,63151,Escoutoux,63,,,63151000AY0178,,,,,,,,,,,,,0,,,,,T,terres,,,3912,3.53645,45.79516
2019-949913,2019-06-07,000001,Vente,6000,,,ESCOUTOUX,B061,63300,63151,Escoutoux,63,,,63151000AO0433,,,,,,,,,,,,,0,,,,,S,sols,,,107,3.56357,45.820412
2019-949913,2019-06-07,000001,Vente,6000,,,ESCOUTOUX,B061,63300,63151,Escoutoux,63,,,63151000AO0434,,,,,,,,,,,,,0,,,,,S,sols,,,75,3.563541,45.820549
2019-949913,2019-06-07,000001,Vente,6000,,,ESCOUTOUX,B061,63300,63151,Escoutoux,63,,,63151000AO0865,,,,,,,,,,,,,0,,,,,S,sols,,,130,3.563604,45.820492
2019-949914,2019-06-07,000002,Vente,39900,,,CHABANNE DE L HOSPICE,B024,63300,63151,Escoutoux,63,,,63151000AC0341,,,,,,,,,,,,,0,,,,,L,landes,,,1889,3.532217,45.83358
2019-949914,2019-06-07,000002,Vente,39900,,,LES PINS,B124,63300,63151,Escoutoux,63,,,63151000AC0343,,,,,,,,,,,,,0,,,,,L,landes,,,11,3.532456,45.833697
2019-950138,2019-06-26,000001,Vente,8000,,,GIROUX,B077,63300,63151,Escoutoux,63,,,63151000AZ0001,,,,,,,,,,,,,0,,,,,P,prés,,,2597,3.523605,45.814844
2019-950138,2019-06-26,000001,Vente,8000,,,GIROUX,B077,63300,63151,Escoutoux,63,,,63151000AZ0003,,,,,,,,,,,,,0,,,,,P,prés,,,3377,3.525544,45.815157
2019-950138,2019-06-26,000001,Vente,8000,,,BONDY,B010,63300,63151,Escoutoux,63,,,63151000AZ0008,,,,,,,,,,,,,0,,,,,T,terres,,,2108,3.529048,45.814969
2019-950138,2019-06-26,000001,Vente,8000,,,BONDY,B010,63300,63151,Escoutoux,63,,,63151000AZ0012,,,,,,,,,,,,,0,,,,,PA,pâtures,,,1093,3.529216,45.814429
2019-950138,2019-06-26,000001,Vente,8000,,,VORTON,B178,63300,63151,Escoutoux,63,,,63151000AZ0031,,,,,,,,,,,,,0,,,,,T,terres,,,3136,3.523874,45.812354
2019-950138,2019-06-26,000001,Vente,8000,,,SOUS LA ROUTE,B161,63300,63151,Escoutoux,63,,,63151000AZ0054,,,,,,,,,,,,,0,,,,,PA,pâtures,,,1755,3.532692,45.809797
2019-950138,2019-06-26,000001,Vente,8000,,,LES PERCIERES,B120,63300,63151,Escoutoux,63,,,63151000AZ0250,,,,,,,,,,,,,0,,,,,T,terres,,,1499,3.520431,45.810952
2019-950138,2019-06-26,000001,Vente,8000,,,LES PERCIERES,B120,63300,63151,Escoutoux,63,,,63151000AZ0260,,,,,,,,,,,,,0,,,,,T,terres,,,3463,3.520528,45.814473
2019-950138,2019-06-26,000001,Vente,8000,,,LES PERCIERES,B120,63300,63151,Escoutoux,63,,,63151000AZ0261,,,,,,,,,,,,,0,,,,,T,terres,,,5181,3.522019,45.814427
2019-950138,2019-06-26,000001,Vente,8000,,,LES PERCIERES,B120,63300,63151,Escoutoux,63,,,63151000AZ0274,,,,,,,,,,,,,0,,,,,PA,pâtures,,,1120,3.519933,45.814584
2019-950138,2019-06-26,000001,Vente,8000,,,CHEZ MARRY,B040,63300,63151,Escoutoux,63,,,63151000BC0201,,,,,,,,,,,,,0,,,,,T,terres,,,3689,3.523505,45.818382
2019-950138,2019-06-26,000001,Vente,8000,,,CHEZ MARRY,B040,63300,63151,Escoutoux,63,,,63151000BC0222,,,,,,,,,,,,,0,,,,,P,prés,,,2595,3.52271,45.815468
2019-950138,2019-06-26,000001,Vente,8000,,,CHEZ MARRY,B040,63300,63151,Escoutoux,63,,,63151000BC0229,,,,,,,,,,,,,0,,,,,T,terres,,,1647,3.522094,45.818488
2019-950138,2019-06-26,000001,Vente,8000,,,CHEZ MARRY,B040,63300,63151,Escoutoux,63,,,63151000BC0233,,,,,,,,,,,,,0,,,,,T,terres,,,1666,3.520969,45.819122
2019-950138,2019-06-26,000001,Vente,8000,,,LA GRAVIERE,B088,63300,63151,Escoutoux,63,,,63151000BC0240,,,,,,,,,,,,,0,,,,,T,terres,,,2860,3.520941,45.816348
2019-950138,2019-06-26,000001,Vente,8000,,,PUY FARRAS,B138,63300,63151,Escoutoux,63,,,63151000BH0011,,,,,,,,,,,,,0,,,,,P,prés,,,1478,3.532703,45.81614
2019-950138,2019-06-26,000001,Vente,8000,,,PUY FARRAS,B138,63300,63151,Escoutoux,63,,,63151000BH0057,,,,,,,,,,,,,0,,,,,PA,pâtures,,,1919,3.535311,45.815404
2019-950290,2019-08-07,000001,Vente,30000,,,LA ROCHERAS,B152,63300,63151,Escoutoux,63,,,63151000AE0608,,,,,,,,,,,,,0,,,,,T,terres,,,4,3.551164,45.829387
2019-950290,2019-08-07,000001,Vente,30000,,,LA ROCHERAS,B152,63300,63151,Escoutoux,63,,,63151000AE0612,,,,,,,,,,,,,0,,,,,T,terres,,,2117,3.551256,45.828962
2019-950295,2019-07-23,000001,Vente,37000,5322,,MONTONNIER,B110,63300,63151,Escoutoux,63,,,63151000AO0770,,,,,,,,,,,,,0,1,Maison,65,4,S,sols,,,779,3.563494,45.825309
2019-950295,2019-07-23,000001,Vente,37000,,,MONTONNIER,B110,63300,63151,Escoutoux,63,,,63151000AO0772,,,,,,,,,,,,,0,,,,,S,sols,,,4,3.563608,45.82541
2019-950310,2019-07-10,000001,Vente,1500,,,PRE DU RUISSEAU,B133,63300,63151,Escoutoux,63,,,63151000BE0268,,,,,,,,,,,,,0,,,,,P,prés,,,9357,3.559291,45.811563
2019-950310,2019-07-10,000001,Vente,1500,,,PRE DU RUISSEAU,B133,63300,63151,Escoutoux,63,,,63151000BE0268,,,,,,,,,,,,,0,,,,,PA,pâtures,,,9358,3.559291,45.811563
2019-950582,2019-08-26,000001,Vente,100,,,LOUHANS,B100,63300,63151,Escoutoux,63,,,63151000AR0112,,,,,,,,,,,,,0,,,,,VE,vergers,,,1197,3.570229,45.80822
2019-950582,2019-08-26,000001,Vente,100,,,LOUHANS,B100,63300,63151,Escoutoux,63,,,63151000AR0113,,,,,,,,,,,,,0,,,,,L,landes,,,2216,3.570849,45.808178
2019-950609,2019-08-27,000001,Vente,700,,,CHAMP DU BOIS,B027,63300,63151,Escoutoux,63,,,63151000BC0102,,,,,,,,,,,,,0,,,,,PA,pâtures,,,2545,3.532449,45.822414
2019-950800,2019-10-21,000001,Vente,110000,,,ESCOUTOUX,B061,63300,63151,Escoutoux,63,,,63151000AO0644,,,,,,,,,,,,,0,,,,,J,jardins,,,181,3.564434,45.820032
2019-950800,2019-10-21,000001,Vente,110000,6,,CHE SAINT SULPICE,0145,63300,63151,Escoutoux,63,,,63151000AO0691,,,,,,,,,,,,,0,1,Maison,105,4,S,sols,,,147,3.564495,45.819992
2019-950832,2019-09-30,000001,Vente,70000,5045,,CROHAT,B052,63300,63151,Escoutoux,63,,,63151000AD0083,,,,,,,,,,,,,0,1,Maison,116,5,S,sols,,,851,3.531519,45.829808
2019-950832,2019-09-30,000001,Vente,70000,,,CROHAT,B052,63300,63151,Escoutoux,63,,,63151000AD0100,,,,,,,,,,,,,0,,,,,T,terres,,,716,3.530902,45.82988
2019-950832,2019-09-30,000001,Vente,70000,,,CROHAT,B052,63300,63151,Escoutoux,63,,,63151000AD0101,,,,,,,,,,,,,0,,,,,T,terres,,,1822,3.530613,45.830127
2019-950833,2019-10-04,000001,Vente,191700,12,,CHE DE LA VERCHERE,0170,63300,63151,Escoutoux,63,,,63151000AB0620,,,,,,,,,,,,,0,1,Maison,111,5,S,sols,,,3488,3.521867,45.827241
2019-950995,2019-10-15,000001,Vente,20000,,,FARRADIAS,B064,63300,63151,Escoutoux,63,,,63151000BH0267,,,,,,,,,,,,,0,,,,,VI,vignes,,,950,3.539987,45.806885
2019-950995,2019-10-15,000001,Vente,20000,,,FARRADIAS,B064,63300,63151,Escoutoux,63,,,63151000BH0267,,,,,,,,,,,,,0,,,,,T,terres,,,101,3.539987,45.806885
2019-950995,2019-10-15,000001,Vente,20000,,,FARRADIAS,B064,63300,63151,Escoutoux,63,,,63151000BH0268,,,,,,,,,,,,,0,,,,,J,jardins,,,407,3.539927,45.80697
2019-951000,2019-10-18,000001,Vente,150,,,LES BONNETS,B011,63300,63151,Escoutoux,63,,,63151000AR0246,,,,,,,,,,,,,0,,,,,BP,peupleraies,,,1306,3.573859,45.798847
2019-951000,2019-10-18,000001,Vente,150,,,LES CHAMPS,B029,63300,63151,Escoutoux,63,,,63151000AS0240,,,,,,,,,,,,,0,,,,,B,bois,,,1390,3.566984,45.800241
2019-951000,2019-10-18,000001,Vente,150,,,LES CHAMPS,B029,63300,63151,Escoutoux,63,,,63151000AS0241,,,,,,,,,,,,,0,,,,,B,bois,,,1486,3.565503,45.800708
2019-951000,2019-10-18,000001,Vente,150,,,LES BONNETS,B011,63300,63151,Escoutoux,63,,,63151000AT0142,,,,,,,,,,,,,0,,,,,BR,futaies résineuses,PIN,Pins,351,3.572121,45.796634
2019-951063,2019-10-23,000001,Vente,3000,,,ESCOUTOUX,B061,63300,63151,Escoutoux,63,,,63151000AO0383,,,,,,,,,,,,,0,,,,,P,prés,,,310,3.564576,45.820311
2019-951107,2019-10-25,000001,Vente,2000,,,LA COMBE,B044,63300,63151,Escoutoux,63,,,63151000AD0199,,,,,,,,,,,,,0,,,,,BF,futaies feuillues,,,1240,3.536965,45.829715
2019-951107,2019-10-25,000001,Vente,2000,,,LA COMBE,B044,63300,63151,Escoutoux,63,,,63151000AD0200,,,,,,,,,,,,,0,,,,,BF,futaies feuillues,,,1352,3.536923,45.829475
2019-951107,2019-10-25,000001,Vente,2000,,,LA GOUTTE,B079,63300,63151,Escoutoux,63,,,63151000AH0002,,,,,,,,,,,,,0,,,,,BS,taillis sous futaie,,,484,3.559874,45.832143
2019-951107,2019-10-25,000001,Vente,2000,,,LA GOUTTE,B079,63300,63151,Escoutoux,63,,,63151000AH0003,,,,,,,,,,,,,0,,,,,BS,taillis sous futaie,,,769,3.559777,45.832373
2019-951107,2019-10-25,000001,Vente,2000,,,LA GOUTTE,B079,63300,63151,Escoutoux,63,,,63151000AH0007,,,,,,,,,,,,,0,,,,,BS,taillis sous futaie,,,1176,3.559441,45.832845
2019-951107,2019-10-25,000001,Vente,2000,,,LA GOUTTE,B079,63300,63151,Escoutoux,63,,,63151000AH0028,,,,,,,,,,,,,0,,,,,P,prés,,,192,3.56229,45.833129
2019-951107,2019-10-25,000001,Vente,2000,,,LES GARNERONS,B075,63300,63151,Escoutoux,63,,,63151000AH0061,,,,,,,,,,,,,0,,,,,P,prés,,,702,3.562374,45.835382
2019-951107,2019-10-25,000001,Vente,2000,,,BOUTERIGE,B014,63300,63151,Escoutoux,63,,,63151000AH0119,,,,,,,,,,,,,0,,,,,PA,pâtures,,,365,3.563126,45.833086
2019-951107,2019-10-25,000001,Vente,2000,,,BOUTERIGE,B014,63300,63151,Escoutoux,63,,,63151000AH0146,,,,,,,,,,,,,0,,,,,P,prés,,,147,3.563074,45.832808
2019-951107,2019-10-25,000001,Vente,2000,,,BOUTERIGE,B014,63300,63151,Escoutoux,63,,,63151000AH0148,,,,,,,,,,,,,0,,,,,P,prés,,,91,3.562755,45.832566
2019-951107,2019-10-25,000001,Vente,2000,,,BOUTERIGE,B014,63300,63151,Escoutoux,63,,,63151000AH0151,,,,,,,,,,,,,0,,,,,P,prés,,,278,3.562636,45.832904
2019-951107,2019-10-25,000001,Vente,2000,,,BOUTERIGE,B014,63300,63151,Escoutoux,63,,,63151000AH0156,,,,,,,,,,,,,0,,,,,BT,taillis simples,,,441,3.56289,45.832317
2019-951107,2019-10-25,000001,Vente,2000,,,BOUTERIGE,B014,63300,63151,Escoutoux,63,,,63151000AH0158,,,,,,,,,,,,,0,,,,,L,landes,,,1500,3.562186,45.831993
2019-951107,2019-10-25,000001,Vente,2000,,,BOUTERIGE,B014,63300,63151,Escoutoux,63,,,63151000AH0160,,,,,,,,,,,,,0,,,,,P,prés,,,2684,3.562923,45.832055
2019-951107,2019-10-25,000001,Vente,2000,,,LES MARTEAUX,B104,63300,63151,Escoutoux,63,,,63151000AH0394,,,,,,,,,,,,,0,,,,,VI,vignes,,,835,3.561085,45.82866
2019-951107,2019-10-25,000001,Vente,2000,,,LE GRUN,B090,63300,63151,Escoutoux,63,,,63151000AH0395,,,,,,,,,,,,,0,,,,,L,landes,,,434,3.560533,45.828411
2019-951107,2019-10-25,000001,Vente,2000,,,LES MARTEAUX,B104,63300,63151,Escoutoux,63,,,63151000AH0396,,,,,,,,,,,,,0,,,,,L,landes,,,455,3.560599,45.828284
2019-951107,2019-10-25,000001,Vente,2000,,,LES MARTEAUX,B104,63300,63151,Escoutoux,63,,,63151000AH0397,,,,,,,,,,,,,0,,,,,VI,vignes,,,585,3.561278,45.828574
2019-951339,2019-12-13,000001,Vente,42000,,,LA ROCHERAS,B152,63300,63151,Escoutoux,63,,,63151000AE0607,,,,,,,,,,,,,0,,,,,T,terres,,,27,3.55093,45.829422
2019-951339,2019-12-13,000001,Vente,42000,,,LA ROCHERAS,B152,63300,63151,Escoutoux,63,,,63151000AE0611,,,,,,,,,,,,,0,,,,,T,terres,,,2454,3.550823,45.828989
2019-951399,2019-11-25,000001,Vente,120000,28,,RUE ALEXANDRE VIALATTE,0005,63300,63151,Escoutoux,63,,,63151000AE0391,,,,,,,,,,,,,0,1,Maison,111,6,P,prés,,,2975,3.553006,45.828436
2019-951399,2019-11-25,000001,Vente,120000,28,,RUE ALEXANDRE VIALATTE,0005,63300,63151,Escoutoux,63,,,63151000AE0391,,,,,,,,,,,,,0,1,Maison,111,6,S,sols,,,1710,3.553006,45.828436
2019-951399,2019-11-25,000001,Vente,120000,28,,RUE ALEXANDRE VIALATTE,0005,63300,63151,Escoutoux,63,,,63151000AE0391,,,,,,,,,,,,,0,1,Maison,111,6,AG,terrains d'agrément,,,1619,3.553006,45.828436
2019-951449,2019-12-04,000001,Vente,306500,,,MAYOUX,B107,63300,63151,Escoutoux,63,,,63151000AB0230,,,,,,,,,,,,,0,,,,,AG,terrains d'agrément,,,1892,3.519446,45.826876
2019-951449,2019-12-04,000001,Vente,306500,,,MAYOUX,B107,63300,63151,Escoutoux,63,,,63151000AB0351,,,,,,,,,,,,,0,,,,,AG,terrains d'agrément,,,21,3.520298,45.826924
2019-951449,2019-12-04,000001,Vente,306500,5773,,MAYOUX,B107,63300,63151,Escoutoux,63,,,63151000AB0356,,,,,,,,,,,,,0,1,Maison,217,5,S,sols,,,819,3.520241,45.827018
2019-951449,2019-12-04,000001,Vente,306500,,,MAYOUX,B107,63300,63151,Escoutoux,63,,,63151000AB0383,,,,,,,,,,,,,0,,,,,AG,terrains d'agrément,,,240,3.520184,45.826867
2019-951449,2019-12-04,000001,Vente,306500,,,MAYOUX,B107,63300,63151,Escoutoux,63,,,63151000AB0384,,,,,,,,,,,,,0,,,,,S,sols,,,134,3.520005,45.82685
2019-951449,2019-12-04,000001,Vente,306500,,,MAYOUX,B107,63300,63151,Escoutoux,63,,,63151000AB0454,,,,,,,,,,,,,0,,,,,AG,terrains d'agrément,,,100,3.520202,45.82682
