id_mutation,date_mutation,numero_disposition,nature_mutation,valeur_fonciere,adresse_numero,adresse_suffixe,adresse_nom_voie,adresse_code_voie,code_postal,code_commune,nom_commune,code_departement,ancien_code_commune,ancien_nom_commune,id_parcelle,ancien_id_parcelle,numero_volume,lot1_numero,lot1_surface_carrez,lot2_numero,lot2_surface_carrez,lot3_numero,lot3_surface_carrez,lot4_numero,lot4_surface_carrez,lot5_numero,lot5_surface_carrez,nombre_lots,code_type_local,type_local,surface_reelle_bati,nombre_pieces_principales,code_nature_culture,nature_culture,code_nature_culture_speciale,nature_culture_speciale,surface_terrain,longitude,latitude
2019-948785,2019-01-16,000001,Vente,133100,5241,,CHARTOIRE,B095,63600,63341,Saint-Ferréol-des-Côtes,63,,,633410000E1635,,,,,,,,,,,,,0,3,Dépendance,,0,S,sols,,,590,3.715588,45.534118
2019-948785,2019-01-16,000001,Vente,133100,5241,,CHARTOIRE,B095,63600,63341,Saint-Ferréol-des-Côtes,63,,,633410000E1635,,,,,,,,,,,,,0,3,Dépendance,,0,P,prés,,,6120,3.715588,45.534118
2019-948785,2019-01-16,000001,Vente,133100,5241,,CHARTOIRE,B095,63600,63341,Saint-Ferréol-des-Côtes,63,,,633410000E1635,,,,,,,,,,,,,0,1,Maison,118,5,S,sols,,,590,3.715588,45.534118
2019-948785,2019-01-16,000001,Vente,133100,5241,,CHARTOIRE,B095,63600,63341,Saint-Ferréol-des-Côtes,63,,,633410000E1635,,,,,,,,,,,,,0,1,Maison,118,5,P,prés,,,6120,3.715588,45.534118
2019-948840,2019-01-18,000001,Vente,38000,,,LE CORDOU,B130,63600,63341,Saint-Ferréol-des-Côtes,63,,,633410000A0314,,,,,,,,,,,,,0,,,,,T,terres,,,4539,3.700683,45.556504
2019-948840,2019-01-18,000001,Vente,38000,,,LE CORDOU,B130,63600,63341,Saint-Ferréol-des-Côtes,63,,,633410000A0317,,,,,,,,,,,,,0,,,,,PA,pâtures,,,890,3.701782,45.555834
2019-948840,2019-01-18,000001,Vente,38000,,,LE CORDOU,B130,63600,63341,Saint-Ferréol-des-Côtes,63,,,633410000A0319,,,,,,,,,,,,,0,,,,,PA,pâtures,,,1363,3.700443,45.555709
2019-948840,2019-01-18,000001,Vente,38000,,,MONT SIMON,B263,63600,63341,Saint-Ferréol-des-Côtes,63,,,633410000A0330,,,,,,,,,,,,,0,,,,,P,prés,,,715,3.700146,45.55585
2019-948930,2019-02-13,000001,Vente,300,,,CHARTOIRE,B095,63600,63341,Saint-Ferréol-des-Côtes,63,,,633410000E0095,,,,,,,,,,,,,0,,,,,BT,taillis simples,,,1476,3.712703,45.533628
2019-948932,2019-02-13,000001,Vente,300,,,COTE PANETON,B134,63600,63341,Saint-Ferréol-des-Côtes,63,,,633410000D0312,,,,,,,,,,,,,0,,,,,PA,pâtures,,,5370,3.711964,45.533741
2019-948932,2019-02-13,000001,Vente,300,,,CHARTOIRE,B095,63600,63341,Saint-Ferréol-des-Côtes,63,,,633410000E0094,,,,,,,,,,,,,0,,,,,BT,taillis simples,,,733,3.712513,45.533314
2019-948982,2019-02-15,000001,Vente,2000,,,LA FONT,B168,63600,63341,Saint-Ferréol-des-Côtes,63,,,633410000C0709,,,,,,,,,,,,,0,,,,,PA,pâtures,,,612,3.686052,45.537032
2019-948982,2019-02-15,000001,Vente,2000,,,LE CLOUVELOUX,B114,63600,63341,Saint-Ferréol-des-Côtes,63,,,633410000C0713,,,,,,,,,,,,,0,,,,,PA,pâtures,,,585,3.685722,45.535404
2019-948982,2019-02-15,000001,Vente,2000,,,LE CLOUVELOUX,B114,63600,63341,Saint-Ferréol-des-Côtes,63,,,633410000C0714,,,,,,,,,,,,,0,,,,,BR,futaies résineuses,,,1120,3.686,45.535331
2019-948982,2019-02-15,000001,Vente,2000,,,LES NAUTES,B270,63600,63341,Saint-Ferréol-des-Côtes,63,,,633410000C0901,,,,,,,,,,,,,0,,,,,PA,pâtures,,,1444,3.685058,45.53538
2019-948982,2019-02-15,000001,Vente,2000,,,LES NAUTES,B270,63600,63341,Saint-Ferréol-des-Côtes,63,,,633410000C0902,,,,,,,,,,,,,0,,,,,BR,futaies résineuses,,,3285,3.685043,45.535937
2019-948982,2019-02-15,000001,Vente,2000,,,LES NAUTES,B270,63600,63341,Saint-Ferréol-des-Côtes,63,,,633410000C0903,,,,,,,,,,,,,0,,,,,PA,pâtures,,,199,3.685199,45.536352
2019-948982,2019-02-15,000001,Vente,2000,,,LES NAUTES,B270,63600,63341,Saint-Ferréol-des-Côtes,63,,,633410000C0905,,,,,,,,,,,,,0,,,,,L,landes,,,137,3.684773,45.535993
2019-948982,2019-02-15,000001,Vente,2000,,,LES NAUTES,B270,63600,63341,Saint-Ferréol-des-Côtes,63,,,633410000C0907,,,,,,,,,,,,,0,,,,,PA,pâtures,,,683,3.684458,45.535289
2019-948982,2019-02-15,000001,Vente,2000,,,LA GRANDE BUGE ET CLOUVELO,B209,63600,63341,Saint-Ferréol-des-Côtes,63,,,633410000C0913,,,,,,,,,,,,,0,,,,,BR,futaies résineuses,,,17848,3.68487,45.534685
2019-948982,2019-02-15,000001,Vente,2000,,,LA BONCHILLA,B032,63600,63341,Saint-Ferréol-des-Côtes,63,,,633410000C1001,,,,,,,,,,,,,0,,,,,BR,futaies résineuses,,,5317,3.682892,45.535512
2019-948984,2019-02-05,000001,Vente,72020,,,MENASSAIRE,B258,63600,63341,Saint-Ferréol-des-Côtes,63,,,633410000B0588,,,,,,,,,,,,,0,,,,,P,prés,,,1942,3.682587,45.546994
2019-948984,2019-02-05,000001,Vente,72020,,,MENASSAIRE,B258,63600,63341,Saint-Ferréol-des-Côtes,63,,,633410000B0588,,,,,,,,,,,,,0,,,,,P,prés,,,1942,3.682587,45.546994
2019-948984,2019-02-05,000001,Vente,72020,5236,,MENASSAIRE,B258,63600,63341,Saint-Ferréol-des-Côtes,63,,,633410000B0589,,,,,,,,,,,,,0,1,Maison,80,4,S,sols,,,436,3.682232,45.547037
2019-949036,2019-02-05,000002,Vente,780,,,LA VAURE,B421,63600,63341,Saint-Ferréol-des-Côtes,63,,,63341000ZA0206,,,,,,,,,,,,,0,,,,,AB,terrains a bâtir,CHEM,Chemin (non groupe),52,3.728307,45.528649
2019-949178,2019-03-05,000001,Vente,350,,,L ESCLADE,B160,63600,63341,Saint-Ferréol-des-Côtes,63,,,633410000B0088,,,,,,,,,,,,,0,,,,,BR,futaies résineuses,,,2419,3.653258,45.546445
2019-949178,2019-03-05,000001,Vente,350,,,LES QUONAIRAS,B343,63600,63341,Saint-Ferréol-des-Côtes,63,,,633410000B1028,,,,,,,,,,,,,0,,,,,L,landes,,,643,3.667507,45.543158
2019-949216,2019-03-16,000001,Vente,294,,,LA VESSEYRE,B432,63600,63341,Saint-Ferréol-des-Côtes,63,,,633410000D0457,,,,,,,,,,,,,0,,,,,BR,futaies résineuses,,,1479,3.701926,45.53294
2019-949238,2019-03-19,000001,Vente,170000,5393,,PUVIC,B337,63600,63341,Saint-Ferréol-des-Côtes,63,,,633410000E1348,,,,,,,,,,,,,0,1,Maison,122,6,S,sols,,,1000,3.718616,45.513145
2019-949238,2019-03-19,000001,Vente,170000,5393,,PUVIC,B337,63600,63341,Saint-Ferréol-des-Côtes,63,,,633410000E1348,,,,,,,,,,,,,0,1,Maison,122,6,T,terres,,,1246,3.718616,45.513145
2019-949338,2019-03-16,000001,Vente,738,,,LA GRANDE TERRE,B211,63600,63341,Saint-Ferréol-des-Côtes,63,,,633410000C0682,,,,,,,,,,,,,0,,,,,BR,futaies résineuses,,,2189,3.693725,45.534451
2019-949338,2019-03-16,000001,Vente,738,,,LA COTE DU BOIS,B133,63600,63341,Saint-Ferréol-des-Côtes,63,,,633410000C0838,,,,,,,,,,,,,0,,,,,BR,futaies résineuses,,,1060,3.688526,45.532006
2019-949338,2019-03-16,000001,Vente,738,,,CHABRELOCHE,B074,63600,63341,Saint-Ferréol-des-Côtes,63,,,633410000E0008,,,,,,,,,,,,,0,,,,,BR,futaies résineuses,,,500,3.708618,45.532048
2019-949466,2019-04-19,000001,Vente,40000,,,LE JACQUETOU,B223,63600,63341,Saint-Ferréol-des-Côtes,63,,,633410000E1931,,,,,,,,,,,,,0,,,,,P,prés,,,2220,3.71434,45.531031
2019-949730,2019-05-21,000001,Vente,1,,,LA VAURE,B421,63600,63341,Saint-Ferréol-des-Côtes,63,,,63341000ZA0180,,,,,,,,,,,,,0,,,,,P,prés,,,28,3.728215,45.532228
2019-949802,2019-05-23,000001,Vente,90000,5187,,PUVIC,B337,63600,63341,Saint-Ferréol-des-Côtes,63,,,633410000E1265,,,,,,,,,,,,,0,1,Maison,130,6,S,sols,,,1236,3.718855,45.512143
2019-949802,2019-05-23,000001,Vente,90000,,,PUVIC,B337,63600,63341,Saint-Ferréol-des-Côtes,63,,,633410000E1978,,,,,,,,,,,,,0,,,,,T,terres,,,683,3.718765,45.512013
2019-949856,2019-05-28,000001,Vente,5100,,,LES FAVATELLES,B162,63600,63341,Saint-Ferréol-des-Côtes,63,,,633410000B0017,,,,,,,,,,,,,0,,,,,BR,futaies résineuses,,,580,3.650062,45.543462
2019-949856,2019-05-28,000001,Vente,5100,,,LA BARTHE,B005,63600,63341,Saint-Ferréol-des-Côtes,63,,,633410000B0513,,,,,,,,,,,,,0,,,,,BT,taillis simples,,,620,3.67517,45.545016
2019-949856,2019-05-28,000001,Vente,5100,,,LA BARTHE,B005,63600,63341,Saint-Ferréol-des-Côtes,63,,,633410000B0520,,,,,,,,,,,,,0,,,,,P,prés,,,3022,3.674096,45.544062
2019-949856,2019-05-28,000001,Vente,5100,,,LA BARTHE,B005,63600,63341,Saint-Ferréol-des-Côtes,63,,,633410000B0521,,,,,,,,,,,,,0,,,,,BR,futaies résineuses,,,3383,3.674984,45.543849
2019-949856,2019-05-28,000001,Vente,5100,,,LA BARTHE,B005,63600,63341,Saint-Ferréol-des-Côtes,63,,,633410000B0521,,,,,,,,,,,,,0,,,,,BR,futaies résineuses,,,3382,3.674984,45.543849
2019-949856,2019-05-28,000001,Vente,5100,,,LE CASSE,B069,63600,63341,Saint-Ferréol-des-Côtes,63,,,633410000B0798,,,,,,,,,,,,,0,,,,,BR,futaies résineuses,,,3840,3.669402,45.539012
2019-949856,2019-05-28,000001,Vente,5100,,,LE SARDERON ET LA GOUTTA,B388,63600,63341,Saint-Ferréol-des-Côtes,63,,,633410000B0908,,,,,,,,,,,,,0,,,,,BR,futaies résineuses,,,1310,3.673867,45.542068
2019-949873,2019-06-08,000001,Vente,500,,,CHASSAGNOLLES,B096,63600,63341,Saint-Ferréol-des-Côtes,63,,,633410000E0804,,,,,,,,,,,,,0,,,,,P,prés,,,212,3.716306,45.527798
2019-949873,2019-06-08,000001,Vente,500,,,CHASSAGNOLLES,B096,63600,63341,Saint-Ferréol-des-Côtes,63,,,633410000E0805,,,,,,,,,,,,,0,,,,,P,prés,,,555,3.716428,45.527339
2019-950018,2019-07-05,000001,Vente,230000,5331,,MONT SIMON,B263,63600,63341,Saint-Ferréol-des-Côtes,63,,,633410000A0876,,,,,,,,,,,,,0,1,Maison,118,5,S,sols,,,773,3.697363,45.553862
2019-950018,2019-07-05,000001,Vente,230000,5331,,MONT SIMON,B263,63600,63341,Saint-Ferréol-des-Côtes,63,,,633410000A0876,,,,,,,,,,,,,0,1,Maison,118,5,J,jardins,,,1217,3.697363,45.553862
2019-950018,2019-07-05,000001,Vente,230000,5331,,MONT SIMON,B263,63600,63341,Saint-Ferréol-des-Côtes,63,,,633410000A0876,,,,,,,,,,,,,0,1,Maison,118,5,P,prés,,,895,3.697363,45.553862
2019-950149,2019-07-24,000001,Vente,190000,5000,,LA VAURE,B421,63600,63341,Saint-Ferréol-des-Côtes,63,,,63341000ZA0116,,,,,,,,,,,,,0,4,Local industriel. commercial ou assimilé,3600,0,S,sols,,,2295,3.728788,45.531958
2019-950149,2019-07-24,000001,Vente,190000,,,LA VAURE,B421,63600,63341,Saint-Ferréol-des-Côtes,63,,,63341000ZA0117,,,,,,,,,,,,,0,,,,,S,sols,,,78,3.728272,45.531928
2019-950149,2019-07-24,000001,Vente,190000,,,LA VAURE,B421,63600,63341,Saint-Ferréol-des-Côtes,63,,,63341000ZA0177,,,,,,,,,,,,,0,,,,,PA,pâtures,,,599,3.728288,45.532126
2019-950149,2019-07-24,000001,Vente,190000,,,LA VAURE,B421,63600,63341,Saint-Ferréol-des-Côtes,63,,,63341000ZA0177,,,,,,,,,,,,,0,,,,,P,prés,,,600,3.728288,45.532126
2019-950149,2019-07-24,000001,Vente,190000,,,LA VAURE,B421,63600,63341,Saint-Ferréol-des-Côtes,63,,,63341000ZA0180,,,,,,,,,,,,,0,,,,,P,prés,,,28,3.728215,45.532228
2019-950229,2019-07-18,000001,Vente,34420,,,AUBIGNAT,B003,63600,63341,Saint-Ferréol-des-Côtes,63,,,633410000E0304,,,,,,,,,,,,,0,,,,,J,jardins,,,855,3.723241,45.5342
2019-950229,2019-07-18,000001,Vente,34420,25,,RTE DEP 56 AUBIGNAT,0020,63600,63341,Saint-Ferréol-des-Côtes,63,,,633410000E0305,,,,,,,,,,,,,0,1,Maison,35,1,S,sols,,,828,3.722915,45.534253
2019-950229,2019-07-18,000001,Vente,34420,,,LES LIDIERES,B241,63600,63341,Saint-Ferréol-des-Côtes,63,,,633410000E0570,,,,,,,,,,,,,0,,,,,PA,pâtures,,,5180,3.721296,45.530124
2019-950229,2019-07-18,000001,Vente,34420,,,LE CROMADIT,B147,63600,63341,Saint-Ferréol-des-Côtes,63,,,633410000E0587,,,,,,,,,,,,,0,,,,,PA,pâtures,,,7112,3.721566,45.528752
2019-950229,2019-07-18,000001,Vente,34420,,,LE CROMADIT,B147,63600,63341,Saint-Ferréol-des-Côtes,63,,,633410000E0587,,,,,,,,,,,,,0,,,,,P,prés,,,7111,3.721566,45.528752
2019-950229,2019-07-18,000001,Vente,34420,,,LE CROMADIT,B147,63600,63341,Saint-Ferréol-des-Côtes,63,,,633410000E0594,,,,,,,,,,,,,0,,,,,T,terres,,,1958,3.72203,45.527691
2019-950375,2019-08-06,000001,Vente,48500,5377,,CHASSAGNOLLES,B096,63600,63341,Saint-Ferréol-des-Côtes,63,,,633410000E1868,,,,,,,,,,,,,0,1,Maison,45,3,S,sols,,,253,3.718289,45.528946
2019-950375,2019-08-06,000001,Vente,48500,5378,,CHASSAGNOLLES,B096,63600,63341,Saint-Ferréol-des-Côtes,63,,,633410000E1869,,,1,,3,,,,,,,,2,3,Dépendance,,0,,,,,,3.718372,45.528982
2019-950375,2019-08-06,000001,Vente,48500,,,CHASSAGNOLLES,B096,63600,63341,Saint-Ferréol-des-Côtes,63,,,633410000E1872,,,,,,,,,,,,,0,,,,,S,sols,,,26,3.718394,45.529035
2019-950375,2019-08-06,000001,Vente,48500,,,CHASSAGNOLLES,B096,63600,63341,Saint-Ferréol-des-Côtes,63,,,633410000E1877,,,,,,,,,,,,,0,,,,,P,prés,,,310,3.718465,45.529218
2019-950646,2019-09-23,000001,Vente,414,,,LES BARTHES,B006,63600,63341,Saint-Ferréol-des-Côtes,63,,,63341000ZA0141,,,,,,,,,,,,,0,,,,,S,sols,,,138,3.727567,45.525561
2019-950647,2019-09-23,000001,Vente,288,,,LES BARTHES,B006,63600,63341,Saint-Ferréol-des-Côtes,63,,,63341000ZA0136,,,,,,,,,,,,,0,,,,,S,sols,,,1,3.727545,45.525282
2019-950647,2019-09-23,000001,Vente,288,,,LES BARTHES,B006,63600,63341,Saint-Ferréol-des-Côtes,63,,,63341000ZA0139,,,,,,,,,,,,,0,,,,,S,sols,,,95,3.727558,45.525354
2019-950648,2019-09-23,000001,Vente,84,,,LES BARTHES,B006,63600,63341,Saint-Ferréol-des-Côtes,63,,,63341000ZA0135,,,,,,,,,,,,,0,,,,,S,sols,,,28,3.727553,45.525254
2019-950687,2019-09-13,000001,Vente,500,,,LA JOSELLE,B227,63600,63341,Saint-Ferréol-des-Côtes,63,,,633410000E1603,,,,,,,,,,,,,0,,,,,P,prés,,,1276,3.715123,45.529816
2019-950775,2019-09-19,000001,Vente,600,,,LES GARNASSES,B189,63600,63341,Saint-Ferréol-des-Côtes,63,,,633410000C0898,,,,,,,,,,,,,0,,,,,L,landes,,,2720,3.685388,45.53415
2019-950780,2019-09-24,000001,Vente,500,,,PRE BOSSU,B321,63600,63341,Saint-Ferréol-des-Côtes,63,,,633410000E2007,,,,,,,,,,,,,0,,,,,P,prés,,,963,3.727464,45.533127
2019-950824,2019-10-10,000001,Vente,71968,,,LE BEZE ET LA COTE,B020,63600,63341,Saint-Ferréol-des-Côtes,63,,,633410000C0403,,,,,,,,,,,,,0,,,,,BT,taillis simples,,,1354,3.696835,45.542754
2019-950824,2019-10-10,000001,Vente,71968,,,LE BEZE ET LA COTE,B020,63600,63341,Saint-Ferréol-des-Côtes,63,,,633410000C0403,,,,,,,,,,,,,0,,,,,BR,futaies résineuses,,,1354,3.696835,45.542754
2019-950824,2019-10-10,000001,Vente,71968,,,CHANTADUC,B090,63600,63341,Saint-Ferréol-des-Côtes,63,,,633410000C0487,,,,,,,,,,,,,0,,,,,PA,pâtures,,,2284,3.697121,45.542253
2019-950824,2019-10-10,000001,Vente,71968,,,CHANTADUC,B090,63600,63341,Saint-Ferréol-des-Côtes,63,,,633410000C0488,,,,,,,,,,,,,0,,,,,P,prés,,,1263,3.69675,45.542197
2019-950824,2019-10-10,000001,Vente,71968,5430,,CHANTADUC,B090,63600,63341,Saint-Ferréol-des-Côtes,63,,,633410000C0489,,,,,,,,,,,,,0,1,Maison,30,1,S,sols,,,343,3.696731,45.542086
2019-950825,2019-10-19,000001,Vente,659,,,LA GURIANNE,B216,63600,63341,Saint-Ferréol-des-Côtes,63,,,633410000D0708,,,,,,,,,,,,,0,,,,,PA,pâtures,,,3500,3.6992,45.533231
2019-950825,2019-10-19,000001,Vente,659,,,LA SAGNE ET LE CHALAT,B374,63600,63341,Saint-Ferréol-des-Côtes,63,,,633410000D0727,,,,,,,,,,,,,0,,,,,P,prés,,,1992,3.697712,45.532403
2019-950827,2019-10-19,000001,Vente,1148,,,LE PLANET,B306,63600,63341,Saint-Ferréol-des-Côtes,63,,,633410000B0445,,,,,,,,,,,,,0,,,,,T,terres,,,5739,3.669849,45.548176
2019-950847,2019-10-17,000001,Vente,5500,,,LES BUGES DU BOIS,B058,63600,63341,Saint-Ferréol-des-Côtes,63,,,633410000E0126,,,,,,,,,,,,,0,,,,,BR,futaies résineuses,,,8173,3.713832,45.535086
2019-950847,2019-10-17,000001,Vente,5500,,,LES BUGES DU BOIS,B058,63600,63341,Saint-Ferréol-des-Côtes,63,,,633410000E0127,,,,,,,,,,,,,0,,,,,BR,futaies résineuses,,,9937,3.714812,45.534902
2019-950847,2019-10-17,000001,Vente,5500,,,PRE DE LAVAURE,B323,63600,63341,Saint-Ferréol-des-Côtes,63,,,633410000E0129,,,,,,,,,,,,,0,,,,,BR,futaies résineuses,,,3511,3.71618,45.534802
2019-950866,2019-10-19,000001,Vente,472,,,LE MONT,B262,63600,63341,Saint-Ferréol-des-Côtes,63,,,633410000B1115,,,,,,,,,,,,,0,,,,,P,prés,,,2360,3.665821,45.547621
2019-950897,2019-10-25,000001,Vente,500,,,PRES DU BOIS,B336,63600,63341,Saint-Ferréol-des-Côtes,63,,,633410000D0628,,,,,,,,,,,,,0,,,,,BR,futaies résineuses,,,1680,3.702887,45.525438
2019-950955,2019-10-25,000001,Vente,2500,,,LES COTES,B135,63600,63341,Saint-Ferréol-des-Côtes,63,,,633410000D0606,,,,,,,,,,,,,0,,,,,BR,futaies résineuses,,,1570,3.702354,45.526821
2019-950955,2019-10-25,000001,Vente,2500,,,PRES DU BOIS,B336,63600,63341,Saint-Ferréol-des-Côtes,63,,,633410000D0627,,,,,,,,,,,,,0,,,,,BR,futaies résineuses,,,7730,3.703402,45.525709
2019-950955,2019-10-25,000001,Vente,2500,,,PRES DU BOIS,B336,63600,63341,Saint-Ferréol-des-Côtes,63,,,633410000D0629,,,,,,,,,,,,,0,,,,,BR,futaies résineuses,,,1700,3.702664,45.525353
2019-950973,2019-10-17,000001,Vente,283.85,,,PRE BOSSU,B321,63600,63341,Saint-Ferréol-des-Côtes,63,,,633410000E2000,,,,,,,,,,,,,0,,,,,P,prés,,,811,3.727243,45.532926
2019-950981,2019-10-23,000001,Vente,3000,,,LA ROCHE,B360,63600,63341,Saint-Ferréol-des-Côtes,63,,,633410000A0940,,,,,,,,,,,,,0,,,,,S,sols,,,3312,3.675345,45.553758
2019-951321,2019-12-06,000001,Vente,3000,,,LA PLANCHET,B303,63600,63341,Saint-Ferréol-des-Côtes,63,,,633410000E1389,,,,,,,,,,,,,0,,,,,BR,futaies résineuses,,,4919,3.714125,45.514483
2019-951321,2019-12-06,000001,Vente,3000,,,BOIS DU TELLE,B029,63600,63341,Saint-Ferréol-des-Côtes,63,,,633410000E1410,,,,,,,,,,,,,0,,,,,BR,futaies résineuses,,,1982,3.712715,45.515121
2019-951321,2019-12-06,000001,Vente,3000,,,LE FOURNEAU,B179,63600,63341,Saint-Ferréol-des-Côtes,63,,,633410000E1443,,,,,,,,,,,,,0,,,,,BT,taillis simples,,,900,3.714893,45.51607
2019-951321,2019-12-06,000001,Vente,3000,,,LE FOURNEAU,B179,63600,63341,Saint-Ferréol-des-Côtes,63,,,633410000E1444,,,,,,,,,,,,,0,,,,,BT,taillis simples,,,286,3.715143,45.516064
2019-951323,2019-11-15,000002,Vente,361.5,,,PRADAILLES,B314,63600,63341,Saint-Ferréol-des-Côtes,63,,,633410000D0845,,,,,,,,,,,,,0,,,,,S,sols,,,8,3.696488,45.528459
2019-951451,2019-11-15,000001,Vente,238.5,,,PRADAILLES,B314,63600,63341,Saint-Ferréol-des-Côtes,63,,,633410000D0870,,,,,,,,,,,,,0,,,,,PA,pâtures,,,159,3.696706,45.528454
2019-951554,2019-12-27,000001,Vente,1,5323,,MONT SIMON,B263,63600,63341,Saint-Ferréol-des-Côtes,63,,,633410000A0874,,,,,,,,,,,,,0,4,Local industriel. commercial ou assimilé,10,0,P,prés,,,173,3.697744,45.554168
2019-951554,2019-12-27,000001,Vente,1,5323,,MONT SIMON,B263,63600,63341,Saint-Ferréol-des-Côtes,63,,,633410000A0874,,,,,,,,,,,,,0,1,Maison,83,4,P,prés,,,173,3.697744,45.554168
2019-951554,2019-12-27,000001,Vente,1,5323,,MONT SIMON,B263,63600,63341,Saint-Ferréol-des-Côtes,63,,,633410000A0874,,,,,,,,,,,,,0,3,Dépendance,,0,P,prés,,,173,3.697744,45.554168
2019-951559,2019-12-27,000001,Vente,122500,5304,,MONT SIMON,B263,63600,63341,Saint-Ferréol-des-Côtes,63,,,633410000A0849,,,,,,,,,,,,,0,1,Maison,81,4,P,prés,,,2778,3.698201,45.554186
2019-951559,2019-12-27,000001,Vente,122500,5304,,MONT SIMON,B263,63600,63341,Saint-Ferréol-des-Côtes,63,,,633410000A0849,,,,,,,,,,,,,0,1,Maison,81,4,J,jardins,,,1513,3.698201,45.554186
2019-951559,2019-12-27,000001,Vente,122500,5304,,MONT SIMON,B263,63600,63341,Saint-Ferréol-des-Côtes,63,,,633410000A0849,,,,,,,,,,,,,0,1,Maison,81,4,S,sols,,,564,3.698201,45.554186
2019-951559,2019-12-27,000001,Vente,122500,5323,,MONT SIMON,B263,63600,63341,Saint-Ferréol-des-Côtes,63,,,633410000A0874,,,,,,,,,,,,,0,3,Dépendance,,0,P,prés,,,173,3.697744,45.554168
2019-951559,2019-12-27,000001,Vente,122500,5323,,MONT SIMON,B263,63600,63341,Saint-Ferréol-des-Côtes,63,,,633410000A0874,,,,,,,,,,,,,0,4,Local industriel. commercial ou assimilé,10,0,P,prés,,,173,3.697744,45.554168
2019-951559,2019-12-27,000001,Vente,122500,5323,,MONT SIMON,B263,63600,63341,Saint-Ferréol-des-Côtes,63,,,633410000A0874,,,,,,,,,,,,,0,1,Maison,83,4,P,prés,,,173,3.697744,45.554168
