id_mutation,date_mutation,numero_disposition,nature_mutation,valeur_fonciere,adresse_numero,adresse_suffixe,adresse_nom_voie,adresse_code_voie,code_postal,code_commune,nom_commune,code_departement,ancien_code_commune,ancien_nom_commune,id_parcelle,ancien_id_parcelle,numero_volume,lot1_numero,lot1_surface_carrez,lot2_numero,lot2_surface_carrez,lot3_numero,lot3_surface_carrez,lot4_numero,lot4_surface_carrez,lot5_numero,lot5_surface_carrez,nombre_lots,code_type_local,type_local,surface_reelle_bati,nombre_pieces_principales,code_nature_culture,nature_culture,code_nature_culture_speciale,nature_culture_speciale,surface_terrain,longitude,latitude
2019-951711,2019-01-10,000001,Vente,150,2,,RUE DU VIEUX PONT,0061,63320,63409,Saurier,63,,,63409000AB0011,,,,,,,,,,,,,0,1,Maison,12,0,S,sols,,,20,3.044497,45.539804
2019-951711,2019-01-10,000001,Vente,150,,,SAURIER,B167,63320,63409,Saurier,63,,,63409000AB0331,,,,,,,,,,,,,0,,,,,L,landes,,,15,3.044463,45.539574
2019-951937,2019-02-13,000001,Vente,1315.65,,,LA PRADA,B135,63320,63409,Saurier,63,,,634090000B0402,,,,,,,,,,,,,0,,,,,L,landes,,,472,3.056911,45.546212
2019-951937,2019-02-13,000001,Vente,1315.65,,,LA PRADA,B135,63320,63409,Saurier,63,,,634090000B0403,,,,,,,,,,,,,0,,,,,BT,taillis simples,,,338,3.057182,45.54624
2019-951937,2019-02-13,000001,Vente,1315.65,,,LA PRADA,B135,63320,63409,Saurier,63,,,634090000B0404,,,,,,,,,,,,,0,,,,,BT,taillis simples,,,230,3.05715,45.546025
2019-951937,2019-02-13,000001,Vente,1315.65,,,LA PRADA,B135,63320,63409,Saurier,63,,,634090000B0405,,,,,,,,,,,,,0,,,,,L,landes,,,288,3.057218,45.545776
2019-951937,2019-02-13,000001,Vente,1315.65,,,LA PRADA,B135,63320,63409,Saurier,63,,,634090000B0408,,,,,,,,,,,,,0,,,,,L,landes,,,330,3.057457,45.546296
2019-951937,2019-02-13,000001,Vente,1315.65,,,LE SAC DU DIABLE,B162,63320,63409,Saurier,63,,,634090000D0150,,,,,,,,,,,,,0,,,,,L,landes,,,12000,3.04742,45.525599
2019-951937,2019-02-13,000001,Vente,1315.65,,,LE SAC DU DIABLE,B162,63320,63409,Saurier,63,,,634090000D0151,,,,,,,,,,,,,0,,,,,L,landes,,,6000,3.046795,45.525766
2019-951937,2019-02-13,000001,Vente,1315.65,,,LE SAC DU DIABLE,B162,63320,63409,Saurier,63,,,634090000D0152,,,,,,,,,,,,,0,,,,,L,landes,,,6315,3.046465,45.526068
2019-952338,2019-04-23,000001,Vente,600,,,LA VIGNE GRANDE,B174,63320,63409,Saurier,63,,,634090000B0148,,,,,,,,,,,,,0,,,,,L,landes,,,212,3.057941,45.547724
2019-952338,2019-04-23,000001,Vente,600,,,CHAUMONT SUD,B051,63320,63409,Saurier,63,,,634090000B0286,,,,,,,,,,,,,0,,,,,L,landes,,,1085,3.065448,45.547717
2019-952338,2019-04-23,000001,Vente,600,,,CHAUMONT SUD,B051,63320,63409,Saurier,63,,,634090000B0714,,,,,,,,,,,,,0,,,,,L,landes,,,9975,3.06613,45.546751
2019-952743,2019-06-27,000001,Vente,177000,5026,,GRAVIERE DU MOUTIER,B100,63320,63409,Saurier,63,,,634090000B0789,,,,,,,,,,,,,0,1,Maison,160,6,S,sols,,,970,3.05426,45.541165
2019-952743,2019-06-27,000001,Vente,177000,5026,,GRAVIERE DU MOUTIER,B100,63320,63409,Saurier,63,,,634090000B0789,,,,,,,,,,,,,0,4,Local industriel. commercial ou assimilé,2248,0,S,sols,,,970,3.05426,45.541165
2019-952743,2019-06-27,000001,Vente,177000,5026,,GRAVIERE DU MOUTIER,B100,63320,63409,Saurier,63,,,634090000B0789,,,,,,,,,,,,,0,4,Local industriel. commercial ou assimilé,2248,0,P,prés,,,3052,3.05426,45.541165
2019-952743,2019-06-27,000001,Vente,177000,5026,,GRAVIERE DU MOUTIER,B100,63320,63409,Saurier,63,,,634090000B0789,,,,,,,,,,,,,0,1,Maison,160,6,P,prés,,,3052,3.05426,45.541165
2019-952743,2019-06-27,000001,Vente,177000,,,GRAVIERE DU MOUTIER,B100,63320,63409,Saurier,63,,,634090000B0791,,,,,,,,,,,,,0,,,,,S,sols,,,865,3.053473,45.541379
2019-953057,2019-09-07,000001,Vente,143800,,,BRIONNET,B013,63320,63409,Saurier,63,,,634090000D0483,,,,,,,,,,,,,0,,,,,L,landes,,,150,3.065019,45.530194
2019-953057,2019-09-07,000001,Vente,143800,3,,CHE DE LA ROCHE,0051,63320,63409,Saurier,63,,,634090000D0861,,,,,,,,,,,,,0,3,Dépendance,,0,P,prés,,,915,3.064712,45.53028
2019-953057,2019-09-07,000001,Vente,143800,3,,CHE DE LA ROCHE,0051,63320,63409,Saurier,63,,,634090000D0861,,,,,,,,,,,,,0,3,Dépendance,,0,S,sols,,,500,3.064712,45.53028
2019-953057,2019-09-07,000001,Vente,143800,3,,CHE DE LA ROCHE,0051,63320,63409,Saurier,63,,,634090000D0861,,,,,,,,,,,,,0,1,Maison,116,4,P,prés,,,915,3.064712,45.53028
2019-953057,2019-09-07,000001,Vente,143800,3,,CHE DE LA ROCHE,0051,63320,63409,Saurier,63,,,634090000D0861,,,,,,,,,,,,,0,1,Maison,116,4,S,sols,,,500,3.064712,45.53028
2019-953141,2019-08-31,000001,Vente,86050,1,,RUE DU LOUVETIER,0035,63320,63409,Saurier,63,,,63409000AB0407,,,,,,,,,,,,,0,1,Maison,60,1,S,sols,,,57,3.043849,45.538293
2019-953141,2019-08-31,000001,Vente,86050,,,SAURIER,B167,63320,63409,Saurier,63,,,63409000AB0408,,,,,,,,,,,,,0,,,,,S,sols,,,24,3.043858,45.538249
2019-953141,2019-08-31,000001,Vente,86050,,,SAURIER,B167,63320,63409,Saurier,63,,,63409000AB0409,,,,,,,,,,,,,0,,,,,S,sols,,,32,3.043869,45.538215
2019-953141,2019-08-31,000001,Vente,86050,,,LE TOUT,B172,63320,63409,Saurier,63,,,63409000AB0513,,,,,,,,,,,,,0,,,,,J,jardins,,,128,3.043187,45.537541
2019-953141,2019-08-31,000001,Vente,86050,,,LE TOUT,B172,63320,63409,Saurier,63,,,63409000AB0513,,,,,,,,,,,,,0,,,,,S,sols,,,6,3.043187,45.537541
2019-953141,2019-08-31,000001,Vente,86050,,,SAURIER,B167,63320,63409,Saurier,63,,,63409000AB0679,,,,,,,,,,,,,0,,,,,S,sols,,,22,3.043793,45.538253
2019-953141,2019-08-31,000001,Vente,86050,,,LA GOUSTA,B094,63320,63409,Saurier,63,,,634090000B0360,,,,,,,,,,,,,0,,,,,L,landes,,,636,3.058863,45.546984
2019-953141,2019-08-31,000001,Vente,86050,,,LA SAUSSE,B168,63320,63409,Saurier,63,,,634090000B0596,,,,,,,,,,,,,0,,,,,L,landes,,,635,3.050157,45.542481
2019-953500,2019-11-21,000001,Vente,100,,,LE SAC DU DIABLE,B162,63320,63409,Saurier,63,,,634090000D0099,,,,,,,,,,,,,0,,,,,T,terres,,,2690,3.050507,45.52724
2019-953548,2019-11-07,000001,Vente,,,,GRAVIERE DU MOUTIER,B100,63320,63409,Saurier,63,,,634090000B0785,,,,,,,,,,,,,0,,,,,P,prés,,,423,3.05478,45.541232
2019-953548,2019-11-07,000001,Vente,,,,GRAVIERE DU MOUTIER,B100,63320,63409,Saurier,63,,,634090000B0786,,,,,,,,,,,,,0,,,,,P,prés,,,52,3.054343,45.54161
2019-953548,2019-11-07,000002,Vente,,,,GRAVIERE DU MOUTIER,B100,63320,63409,Saurier,63,,,634090000B0551,,,,,,,,,,,,,0,,,,,P,prés,,,250,3.055092,45.540947
2019-953548,2019-11-07,000002,Vente,,,,GRAVIERE DU MOUTIER,B100,63320,63409,Saurier,63,,,634090000B0783,,,,,,,,,,,,,0,,,,,P,prés,,,471,3.054833,45.541271
2019-953548,2019-11-07,000002,Vente,,,,GRAVIERE DU MOUTIER,B100,63320,63409,Saurier,63,,,634090000B0787,,,,,,,,,,,,,0,,,,,P,prés,,,491,3.054544,45.541342
2019-953666,2019-11-29,000001,Vente,91200,32,,RUE DES RELAIS,0048,63320,63409,Saurier,63,,,63409000AB0255,,,,,,,,,,,,,0,1,Maison,118,4,S,sols,,,613,3.045239,45.537684
2019-953760,2019-12-27,000001,Vente,136.71,,,ROZIER,B160,63320,63409,Saurier,63,,,634090000C0374,,,,,,,,,,,,,0,,,,,L,landes,,,66,3.050905,45.53477
2019-953760,2019-12-27,000001,Vente,136.71,,,ROZIER,B160,63320,63409,Saurier,63,,,634090000C0375,,,,,,,,,,,,,0,,,,,L,landes,,,24,3.050861,45.534731
