id_mutation,date_mutation,numero_disposition,nature_mutation,valeur_fonciere,adresse_numero,adresse_suffixe,adresse_nom_voie,adresse_code_voie,code_postal,code_commune,nom_commune,code_departement,ancien_code_commune,ancien_nom_commune,id_parcelle,ancien_id_parcelle,numero_volume,lot1_numero,lot1_surface_carrez,lot2_numero,lot2_surface_carrez,lot3_numero,lot3_surface_carrez,lot4_numero,lot4_surface_carrez,lot5_numero,lot5_surface_carrez,nombre_lots,code_type_local,type_local,surface_reelle_bati,nombre_pieces_principales,code_nature_culture,nature_culture,code_nature_culture_speciale,nature_culture_speciale,surface_terrain,longitude,latitude
2019-954178,2019-01-18,000001,Vente,80910,,,LAGRAULET,B028,64330,64199,Diusse,64,,,641990000A0065,,,,,,,,,,,,,0,,,,,T,terres,,,710,-0.164386,43.570207
2019-954178,2019-01-18,000001,Vente,80910,,,LAGRAULET,B028,64330,64199,Diusse,64,,,641990000A0066,,,,,,,,,,,,,0,,,,,J,jardins,,,620,-0.164242,43.569879
2019-954178,2019-01-18,000001,Vente,80910,,,LAGRAULET,B028,64330,64199,Diusse,64,,,641990000A0067,,,,,,,,,,,,,0,,,,,AG,terrains d'agrément,,,1694,-0.164186,43.569414
2019-954178,2019-01-18,000001,Vente,80910,,,LAGRAULET,B028,64330,64199,Diusse,64,,,641990000A0067,,,,,,,,,,,,,0,,,,,S,sols,,,66,-0.164186,43.569414
2019-954178,2019-01-18,000001,Vente,80910,1,,CHE DE LACOUME,0090,64330,64199,Diusse,64,,,641990000A0068,,,,,,,,,,,,,0,1,Maison,165,7,S,sols,,,630,-0.16426,43.569255
2019-955427,2019-03-28,000001,Vente,46000,,,LEES,B033,64330,64199,Diusse,64,,,641990000C0240,,,,,,,,,,,,,0,,,,,S,sols,,,2902,-0.197166,43.558492
2019-955427,2019-03-28,000001,Vente,46000,5060,,LEES,B033,64330,64199,Diusse,64,,,641990000C0241,,,,,,,,,,,,,0,4,Local industriel. commercial ou assimilé,,0,S,sols,,,1798,-0.196664,43.558762
2019-955427,2019-03-28,000001,Vente,46000,,,LEES,B033,64330,64199,Diusse,64,,,641990000C0248,,,,,,,,,,,,,0,,,,,S,sols,,,158,-0.196437,43.558806
2019-955621,2019-04-12,000001,Vente,52500,,,LEES,B033,64330,64199,Diusse,64,,,641990000C0311,,,,,,,,,,,,,0,,,,,T,terres,,,4464,-0.195908,43.558993
2019-955626,2019-04-12,000001,Vente,27000,,,LEES,B033,64330,64199,Diusse,64,,,641990000C0015,,,,,,,,,,,,,0,,,,,T,terres,,,7490,-0.194515,43.560706
2019-955626,2019-04-12,000001,Vente,27000,,,LEES,B033,64330,64199,Diusse,64,,,641990000C0027,,,,,,,,,,,,,0,,,,,T,terres,,,2905,-0.191177,43.560905
2019-955626,2019-04-12,000001,Vente,27000,,,LEES,B033,64330,64199,Diusse,64,,,641990000C0242,,,,,,,,,,,,,0,,,,,T,terres,,,210,-0.194128,43.56007
2019-955626,2019-04-12,000001,Vente,27000,,,LEES,B033,64330,64199,Diusse,64,,,641990000C0313,,,,,,,,,,,,,0,,,,,T,terres,,,3455,-0.193694,43.559942
2019-955626,2019-04-12,000001,Vente,27000,,,LEES,B033,64330,64199,Diusse,64,,,641990000C0315,,,,,,,,,,,,,0,,,,,T,terres,,,18415,-0.192405,43.560442
2019-955626,2019-04-12,000001,Vente,27000,,,LEES,B033,64330,64199,Diusse,64,,,641990000C0317,,,,,,,,,,,,,0,,,,,T,terres,,,3470,-0.190843,43.56049
2019-957472,2019-07-30,000001,Vente,125000,1,,CHE LAMARRIGUE,0100,64330,64199,Diusse,64,,,641990000C0177,,,,,,,,,,,,,0,1,Maison,188,6,S,sols,,,1470,-0.179811,43.562168
2019-957472,2019-07-30,000001,Vente,125000,,,COTE NEUVE,B012,64330,64199,Diusse,64,,,641990000C0178,,,,,,,,,,,,,0,,,,,P,prés,,,1670,-0.180211,43.562268
2019-957472,2019-07-30,000001,Vente,125000,,,COTE NEUVE,B012,64330,64199,Diusse,64,,,641990000C0180,,,,,,,,,,,,,0,,,,,T,terres,,,7900,-0.181105,43.562857
2019-957472,2019-07-30,000001,Vente,125000,,,COTE NEUVE,B012,64330,64199,Diusse,64,,,641990000C0181,,,,,,,,,,,,,0,,,,,T,terres,,,4260,-0.18075,43.563681
2019-957472,2019-07-30,000001,Vente,125000,,,COTE NEUVE,B012,64330,64199,Diusse,64,,,641990000C0184,,,,,,,,,,,,,0,,,,,BT,taillis simples,,,2160,-0.17999,43.563596
2019-957472,2019-07-30,000001,Vente,125000,,,COTE NEUVE,B012,64330,64199,Diusse,64,,,641990000C0185,,,,,,,,,,,,,0,,,,,P,prés,,,755,-0.180404,43.563568
2019-957472,2019-07-30,000001,Vente,125000,,,COTE NEUVE,B012,64330,64199,Diusse,64,,,641990000C0186,,,,,,,,,,,,,0,,,,,T,terres,,,4120,-0.180322,43.563184
2019-957472,2019-07-30,000001,Vente,125000,,,COTE NEUVE,B012,64330,64199,Diusse,64,,,641990000C0187,,,,,,,,,,,,,0,,,,,J,jardins,,,830,-0.18029,43.562749
2019-957472,2019-07-30,000001,Vente,125000,,,COTE NEUVE,B012,64330,64199,Diusse,64,,,641990000C0188,,,,,,,,,,,,,0,,,,,T,terres,,,1630,-0.179999,43.562494
2019-957472,2019-07-30,000001,Vente,125000,,,COTE NEUVE,B012,64330,64199,Diusse,64,,,641990000C0189,,,,,,,,,,,,,0,,,,,BT,taillis simples,,,1620,-0.179869,43.562874
2019-959956,2019-11-08,000001,Vente,22000,,,LEES,B033,64330,64199,Diusse,64,,,641990000C0028,,,,,,,,,,,,,0,,,,,T,terres,,,3035,-0.191636,43.561222
2019-959956,2019-11-08,000001,Vente,22000,,,LEES,B033,64330,64199,Diusse,64,,,641990000C0029,,,,,,,,,,,,,0,,,,,BF,futaies feuillues,CHENE,Chênes,3020,-0.192524,43.560867
2019-959956,2019-11-08,000001,Vente,22000,,,HAUT DE DIUSSE,B025,64330,64199,Diusse,64,,,641990000C0134,,,,,,,,,,,,,0,,,,,T,terres,,,3440,-0.178351,43.565233
2019-959956,2019-11-08,000001,Vente,22000,,,HAUT DE DIUSSE,B025,64330,64199,Diusse,64,,,641990000C0135,,,,,,,,,,,,,0,,,,,T,terres,,,3550,-0.178975,43.564977
2019-959956,2019-11-08,000001,Vente,22000,,,HAUT DE DIUSSE,B025,64330,64199,Diusse,64,,,641990000C0136,,,,,,,,,,,,,0,,,,,P,prés,,,6170,-0.178086,43.564404
2019-959956,2019-11-08,000001,Vente,22000,,,HAUT DE DIUSSE,B025,64330,64199,Diusse,64,,,641990000C0137,,,,,,,,,,,,,0,,,,,T,terres,,,950,-0.177714,43.564716
2019-959956,2019-11-08,000001,Vente,22000,,,HAUT DE DIUSSE,B025,64330,64199,Diusse,64,,,641990000C0138,,,,,,,,,,,,,0,,,,,BT,taillis simples,,,1840,-0.1778,43.564486
2019-959956,2019-11-08,000001,Vente,22000,,,HAUT DE DIUSSE,B025,64330,64199,Diusse,64,,,641990000C0139,,,,,,,,,,,,,0,,,,,T,terres,,,6680,-0.177495,43.563731
2019-959956,2019-11-08,000001,Vente,22000,,,HAUT DE DIUSSE,B025,64330,64199,Diusse,64,,,641990000C0140,,,,,,,,,,,,,0,,,,,T,terres,,,4360,-0.177174,43.564312
2019-959956,2019-11-08,000001,Vente,22000,,,COTE NEUVE,B012,64330,64199,Diusse,64,,,641990000C0158,,,,,,,,,,,,,0,,,,,BT,taillis simples,,,7960,-0.182162,43.564542
2019-959956,2019-11-08,000001,Vente,22000,,,COTE NEUVE,B012,64330,64199,Diusse,64,,,641990000C0160,,,,,,,,,,,,,0,,,,,T,terres,,,31300,-0.183232,43.564412
2019-959956,2019-11-08,000001,Vente,22000,,,COTE NEUVE,B012,64330,64199,Diusse,64,,,641990000C0182,,,,,,,,,,,,,0,,,,,L,landes,VAGUE,Terrain vague,7730,-0.181542,43.564633
2019-960740,2019-12-30,000001,Vente,155700,2,,CHE QUEY,0260,64330,64199,Diusse,64,,,641990000C0233,,,,,,,,,,,,,0,1,Maison,112,4,S,sols,,,1050,-0.176378,43.557882
2019-960740,2019-12-30,000001,Vente,155700,,,QUEY,B045,64330,64199,Diusse,64,,,641990000C0270,,,,,,,,,,,,,0,,,,,L,landes,VAGUE,Terrain vague,45,-0.176237,43.557698
2019-960740,2019-12-30,000001,Vente,155700,,,QUEY,B045,64330,64199,Diusse,64,,,641990000C0272,,,,,,,,,,,,,0,,,,,J,jardins,,,770,-0.176444,43.557878
