id_mutation,date_mutation,numero_disposition,nature_mutation,valeur_fonciere,adresse_numero,adresse_suffixe,adresse_nom_voie,adresse_code_voie,code_postal,code_commune,nom_commune,code_departement,ancien_code_commune,ancien_nom_commune,id_parcelle,ancien_id_parcelle,numero_volume,lot1_numero,lot1_surface_carrez,lot2_numero,lot2_surface_carrez,lot3_numero,lot3_surface_carrez,lot4_numero,lot4_surface_carrez,lot5_numero,lot5_surface_carrez,nombre_lots,code_type_local,type_local,surface_reelle_bati,nombre_pieces_principales,code_nature_culture,nature_culture,code_nature_culture_speciale,nature_culture_speciale,surface_terrain,longitude,latitude
2019-973072,2019-05-06,000001,Vente,278000,6,,CHE DE L ARREMISSANT,0005,65100,65197,Ger,65,,,65197000AA0139,,,,,,,,,,,,,0,1,Maison,220,5,S,sols,,,1000,-0.039362,43.057046
2019-973072,2019-05-06,000001,Vente,278000,6,,CHE DE L ARREMISSANT,0005,65100,65197,Ger,65,,,65197000AA0139,,,,,,,,,,,,,0,1,Maison,220,5,P,prés,,,3115,-0.039362,43.057046
2019-973072,2019-05-06,000001,Vente,278000,,,LE VILLAGE,B006,65100,65197,Ger,65,,,65197000AA0218,,,,,,,,,,,,,0,,,,,P,prés,,,1376,-0.039564,43.056697
2019-973072,2019-05-06,000001,Vente,278000,,,LE VILLAGE,B006,65100,65197,Ger,65,,,65197000AA0218,,,,,,,,,,,,,0,,,,,T,terres,,,894,-0.039564,43.056697
2019-973118,2019-05-09,000001,Vente,135000,2,,CHE DE LA BARAILLETTE,0020,65100,65197,Ger,65,,,65197000AA0103,,,,,,,,,,,,,0,1,Maison,117,4,S,sols,,,656,-0.040034,43.05401
2019-973397,2019-05-29,000001,Vente,182000,21,B,RUE DES LANETTES,0060,65100,65197,Ger,65,,,65197000AA0234,,,,,,,,,,,,,0,1,Maison,84,4,S,sols,,,525,-0.043405,43.051957
2019-975889,2019-09-23,000001,Vente,200000,6,,RTE DE LOURDES,0065,65100,65197,Ger,65,,,65197000AA0060,,,,,,,,,,,,,0,1,Maison,140,6,S,sols,,,3617,-0.040765,43.056495
2019-975889,2019-09-23,000001,Vente,200000,,,LE VILLAGE,B006,65100,65197,Ger,65,,,65197000AA0130,,,,,,,,,,,,,0,,,,,BF,futaies feuillues,HETRE,Hêtres,1659,-0.039801,43.056432
2019-978028,2019-02-22,000001,Vente,73000,,,LE VILLAGE,B006,65100,65197,Ger,65,,,65197000AA0251,,,,,,,,,,,,,0,,,,,P,prés,,,1072,-0.040735,43.057136
