id_mutation,date_mutation,numero_disposition,nature_mutation,valeur_fonciere,adresse_numero,adresse_suffixe,adresse_nom_voie,adresse_code_voie,code_postal,code_commune,nom_commune,code_departement,ancien_code_commune,ancien_nom_commune,id_parcelle,ancien_id_parcelle,numero_volume,lot1_numero,lot1_surface_carrez,lot2_numero,lot2_surface_carrez,lot3_numero,lot3_surface_carrez,lot4_numero,lot4_surface_carrez,lot5_numero,lot5_surface_carrez,nombre_lots,code_type_local,type_local,surface_reelle_bati,nombre_pieces_principales,code_nature_culture,nature_culture,code_nature_culture_speciale,nature_culture_speciale,surface_terrain,longitude,latitude
2019-972511,2019-03-26,000001,Vente,31500,,,QUARTIER DE CAYREHOURS,B037,65320,65292,Luquet,65,,,65292000ZK0046,,,,,,,,,,,,,0,,,,,T,terres,,,1367,-0.115448,43.260915
2019-972591,2019-03-21,000001,Vente,96000,13,,RTE DE CABARRE,0005,65320,65292,Luquet,65,,,652920000D0102,,,,,,,,,,,,,0,1,Maison,83,3,S,sols,,,841,-0.123723,43.263364
2019-972591,2019-03-21,000001,Vente,96000,,,MARQUE DARRE,B029,65320,65292,Luquet,65,,,652920000D0103,,,,,,,,,,,,,0,,,,,S,sols,,,33,-0.123528,43.263347
2019-972591,2019-03-21,000001,Vente,96000,,,MARQUE DARRE,B029,65320,65292,Luquet,65,,,652920000D0103,,,,,,,,,,,,,0,,,,,T,terres,,,1491,-0.123528,43.263347
2019-972802,2019-04-10,000001,Vente,123000,,,LE VILLAGE,B040,65320,65292,Luquet,65,,,652920000D0124,,,,,,,,,,,,,0,,,,,S,sols,,,614,-0.120252,43.264928
2019-972802,2019-04-10,000001,Vente,123000,4,,RTE DU VILLAGE,0055,65320,65292,Luquet,65,,,652920000D0125,,,,,,,,,,,,,0,1,Maison,109,4,S,sols,,,340,-0.120004,43.264977
2019-972802,2019-04-10,000001,Vente,123000,5029,,RTE DU VILLAGE,0055,65320,65292,Luquet,65,,,652920000D0271,,,,,,,,,,,,,0,3,Dépendance,,0,S,sols,,,88,-0.120048,43.265057
2019-972932,2019-04-16,000001,Vente,1000,,,CASSAGNET,B011,65320,65292,Luquet,65,,,65292000ZL0039,,,,,,,,,,,,,0,,,,,BT,taillis simples,,,3192,-0.103021,43.253325
2019-973295,2019-05-13,000001,Vente,110000,43,B,RTE DU VILLAGE,0055,65320,65292,Luquet,65,,,65292000ZM0016,,,,,,,,,,,,,0,1,Maison,99,2,S,sols,,,1690,-0.116529,43.256914
2019-974308,2019-07-11,000001,Vente,233000,8,,CAMI DE BARZU,0008,65320,65292,Luquet,65,,,652920000D0170,,,,,,,,,,,,,0,1,Maison,118,4,S,sols,,,1554,-0.119861,43.25623
2019-975192,2019-09-06,000002,Vente,35000,,,QUARTIER DE CAYREHOURS,B037,65320,65292,Luquet,65,,,65292000ZK0067,,,,,,,,,,,,,0,,,,,T,terres,,,1500,-0.115011,43.260916
2019-975631,2019-09-27,000002,Vente,176.8,,,LE VILLAGE,B040,65320,65292,Luquet,65,,,652920000B0339,,,,,,,,,,,,,0,,,,,S,sols,,,272,-0.118131,43.265229
2019-975945,2019-10-11,000001,Vente,10500,,,LE CLARET,B014,65320,65292,Luquet,65,,,65292000ZH0001,,,,,,,,,,,,,0,,,,,BT,taillis simples,,,8670,-0.13595,43.279173
2019-975945,2019-10-11,000001,Vente,10500,,,LE CLARET,B014,65320,65292,Luquet,65,,,65292000ZH0001,,,,,,,,,,,,,0,,,,,T,terres,,,12305,-0.13595,43.279173
2019-976057,2019-10-10,000002,Vente,85500,,,PONDIC,B033,65320,65292,Luquet,65,,,65292000ZB0046,,,,,,,,,,,,,0,,,,,T,terres,,,1000,-0.125808,43.262054
2019-976057,2019-10-10,000002,Vente,85500,,,PONDIC,B033,65320,65292,Luquet,65,,,65292000ZB0047,,,,,,,,,,,,,0,,,,,T,terres,,,1000,,
2019-976057,2019-10-10,000002,Vente,85500,,,PONDIC,B033,65320,65292,Luquet,65,,,65292000ZB0048,,,,,,,,,,,,,0,,,,,T,terres,,,2158,-0.125874,43.261821
2019-976503,2019-10-25,000001,Vente,30000,,,MARQUE DARRE,B029,65320,65292,Luquet,65,,,65292000ZI0095,,,,,,,,,,,,,0,,,,,T,terres,,,1802,-0.124217,43.263595
