id_mutation,date_mutation,numero_disposition,nature_mutation,valeur_fonciere,adresse_numero,adresse_suffixe,adresse_nom_voie,adresse_code_voie,code_postal,code_commune,nom_commune,code_departement,ancien_code_commune,ancien_nom_commune,id_parcelle,ancien_id_parcelle,numero_volume,lot1_numero,lot1_surface_carrez,lot2_numero,lot2_surface_carrez,lot3_numero,lot3_surface_carrez,lot4_numero,lot4_surface_carrez,lot5_numero,lot5_surface_carrez,nombre_lots,code_type_local,type_local,surface_reelle_bati,nombre_pieces_principales,code_nature_culture,nature_culture,code_nature_culture_speciale,nature_culture_speciale,surface_terrain,longitude,latitude
2019-973922,2019-06-24,000001,Vente,121000,,,LES BOIRIES,B008,65700,65387,Saint-Lanne,65,,,653870000B0129,,,,,,,,,,,,,0,,,,,P,prés,,,2200,-0.080702,43.580364
2019-973922,2019-06-24,000001,Vente,121000,330,,RTE DE VIELLA,0170,65700,65387,Saint-Lanne,65,,,653870000B0130,,,,,,,,,,,,,0,1,Maison,126,3,S,sols,,,870,-0.081002,43.5803
2019-973922,2019-06-24,000001,Vente,121000,,,LES BOIRIES,B008,65700,65387,Saint-Lanne,65,,,653870000B0131,,,,,,,,,,,,,0,,,,,S,sols,,,520,-0.081154,43.580474
2019-975271,2019-09-04,000001,Vente,6750,,,BATURLES,B004,65700,65387,Saint-Lanne,65,,,653870000E0083,,,,,,,,,,,,,0,,,,,L,landes,,,5395,-0.049108,43.607751
2019-975271,2019-09-04,000001,Vente,6750,,,BATURLES,B004,65700,65387,Saint-Lanne,65,,,653870000E0084,,,,,,,,,,,,,0,,,,,BT,taillis simples,,,5845,-0.04844,43.607096
2019-975271,2019-09-04,000001,Vente,6750,,,BATURLES,B004,65700,65387,Saint-Lanne,65,,,653870000E0085,,,,,,,,,,,,,0,,,,,L,landes,,,4945,-0.049613,43.607367
2019-975271,2019-09-04,000001,Vente,6750,,,BATURLES,B004,65700,65387,Saint-Lanne,65,,,653870000E0086,,,,,,,,,,,,,0,,,,,BT,taillis simples,,,3285,-0.050264,43.607195
2019-975271,2019-09-04,000001,Vente,6750,,,BATURLES,B004,65700,65387,Saint-Lanne,65,,,653870000E0087,,,,,,,,,,,,,0,,,,,L,landes,,,9600,-0.04907,43.606679
2019-975271,2019-09-04,000001,Vente,6750,,,BATURLES,B004,65700,65387,Saint-Lanne,65,,,653870000E0088,,,,,,,,,,,,,0,,,,,BT,taillis simples,,,2515,-0.049119,43.605924
2019-975271,2019-09-04,000001,Vente,6750,,,BATURLES,B004,65700,65387,Saint-Lanne,65,,,653870000E0089,,,,,,,,,,,,,0,,,,,BT,taillis simples,,,5840,-0.049998,43.606424
2019-975357,2019-09-11,000001,Vente,120000,,,HOURREDE,B031,65700,65387,Saint-Lanne,65,,,653870000F0083,,,,,,,,,,,,,0,,,,,L,landes,,,880,-0.057314,43.592158
2019-975357,2019-09-11,000001,Vente,120000,,,HOURREDE,B031,65700,65387,Saint-Lanne,65,,,653870000F0093,,,,,,,,,,,,,0,,,,,T,terres,,,2000,-0.05683,43.592663
2019-975357,2019-09-11,000001,Vente,120000,,,HOURREDE,B031,65700,65387,Saint-Lanne,65,,,653870000F0093,,,,,,,,,,,,,0,,,,,S,sols,,,500,-0.05683,43.592663
2019-975357,2019-09-11,000001,Vente,120000,,,HOURREDE,B031,65700,65387,Saint-Lanne,65,,,653870000F0094,,,,,,,,,,,,,0,,,,,S,sols,,,550,-0.056913,43.592894
2019-975357,2019-09-11,000001,Vente,120000,842,,RTE DE L EGLISE,0055,65700,65387,Saint-Lanne,65,,,653870000F0095,,,,,,,,,,,,,0,1,Maison,153,4,S,sols,,,610,-0.056585,43.592853
2019-975357,2019-09-11,000001,Vente,120000,,,HOURREDE,B031,65700,65387,Saint-Lanne,65,,,653870000F0096,,,,,,,,,,,,,0,,,,,J,jardins,,,150,-0.056372,43.592882
2019-975357,2019-09-11,000001,Vente,120000,,,HOURREDE,B031,65700,65387,Saint-Lanne,65,,,653870000F0097,,,,,,,,,,,,,0,,,,,P,prés,,,650,-0.05627,43.592767
2019-975357,2019-09-11,000001,Vente,120000,,,HOURREDE,B031,65700,65387,Saint-Lanne,65,,,653870000F0098,,,,,,,,,,,,,0,,,,,BT,taillis simples,,,440,-0.056395,43.592516
2019-975357,2019-09-11,000001,Vente,120000,,,HOURREDE,B031,65700,65387,Saint-Lanne,65,,,653870000F0099,,,,,,,,,,,,,0,,,,,BT,taillis simples,,,440,-0.056554,43.592381
2019-975357,2019-09-11,000001,Vente,120000,,,HOURREDE,B031,65700,65387,Saint-Lanne,65,,,653870000F0100,,,,,,,,,,,,,0,,,,,L,landes,,,530,-0.056647,43.592155
2019-975357,2019-09-11,000001,Vente,120000,,,PARC DES NEGRES,B046,65700,65387,Saint-Lanne,65,,,653870000F0101,,,,,,,,,,,,,0,,,,,BT,taillis simples,,,1290,-0.056326,43.592267
2019-975357,2019-09-11,000001,Vente,120000,,,PARC DES NEGRES,B046,65700,65387,Saint-Lanne,65,,,653870000F0102,,,,,,,,,,,,,0,,,,,P,prés,,,3130,-0.055737,43.592554
2019-975357,2019-09-11,000001,Vente,120000,,,PARC DES NEGRES,B046,65700,65387,Saint-Lanne,65,,,653870000F0103,,,,,,,,,,,,,0,,,,,BT,taillis simples,,,340,-0.055701,43.59231
2019-975357,2019-09-11,000001,Vente,120000,,,PARC DES NEGRES,B046,65700,65387,Saint-Lanne,65,,,653870000F0106,,,,,,,,,,,,,0,,,,,L,landes,,,2430,-0.056422,43.591835
2019-975437,2019-09-20,000001,Vente,2000,,,PLANTE,B051,65700,65387,Saint-Lanne,65,,,653870000D0151,,,,,,,,,,,,,0,,,,,T,terres,,,1060,-0.059234,43.593507
2019-975437,2019-09-20,000001,Vente,2000,,,PLANTE,B051,65700,65387,Saint-Lanne,65,,,653870000D0152,,,,,,,,,,,,,0,,,,,J,jardins,,,210,-0.059377,43.593755
2019-975437,2019-09-20,000001,Vente,2000,,,PLANTE,B051,65700,65387,Saint-Lanne,65,,,653870000D0153,,,,,,,,,,,,,0,,,,,T,terres,,,370,-0.059181,43.593713
2019-975437,2019-09-20,000001,Vente,2000,,,PLANTE,B051,65700,65387,Saint-Lanne,65,,,653870000D0154,,,,,,,,,,,,,0,,,,,T,terres,,,3060,-0.059143,43.594171
2019-975638,2019-09-23,000001,Vente,60000,301,,CHE DE PENAS,0118,65700,65387,Saint-Lanne,65,,,653870000F0388,,,,,,,,,,,,,0,1,Maison,69,2,S,sols,,,760,-0.06024,43.589934
2019-977208,2019-12-27,000001,Vente,100000,,,LE SERP,B057,65700,65387,Saint-Lanne,65,,,653870000F0282,,,,,,,,,,,,,0,,,,,BT,taillis simples,,,1010,-0.066158,43.589451
2019-977208,2019-12-27,000001,Vente,100000,,,LE SERP,B057,65700,65387,Saint-Lanne,65,,,653870000F0285,,,,,,,,,,,,,0,,,,,P,prés,,,2382,-0.065317,43.588689
2019-977208,2019-12-27,000001,Vente,100000,221,,CHE DE GUILLAN,0075,65700,65387,Saint-Lanne,65,,,653870000F0286,,,,,,,,,,,,,0,1,Maison,140,5,S,sols,,,828,-0.065096,43.588193
2019-977208,2019-12-27,000001,Vente,100000,,,LE SERP,B057,65700,65387,Saint-Lanne,65,,,653870000F0296,,,,,,,,,,,,,0,,,,,P,prés,,,530,-0.064941,43.587631
2019-977208,2019-12-27,000001,Vente,100000,,,LE SERP,B057,65700,65387,Saint-Lanne,65,,,653870000F0298,,,,,,,,,,,,,0,,,,,J,jardins,,,300,-0.064917,43.587848
2019-977208,2019-12-27,000001,Vente,100000,,,LE SERP,B057,65700,65387,Saint-Lanne,65,,,653870000F0390,,,,,,,,,,,,,0,,,,,BS,taillis sous futaie,,,1254,-0.065643,43.589284
