id_mutation,date_mutation,numero_disposition,nature_mutation,valeur_fonciere,adresse_numero,adresse_suffixe,adresse_nom_voie,adresse_code_voie,code_postal,code_commune,nom_commune,code_departement,ancien_code_commune,ancien_nom_commune,id_parcelle,ancien_id_parcelle,numero_volume,lot1_numero,lot1_surface_carrez,lot2_numero,lot2_surface_carrez,lot3_numero,lot3_surface_carrez,lot4_numero,lot4_surface_carrez,lot5_numero,lot5_surface_carrez,nombre_lots,code_type_local,type_local,surface_reelle_bati,nombre_pieces_principales,code_nature_culture,nature_culture,code_nature_culture_speciale,nature_culture_speciale,surface_terrain,longitude,latitude
2019-1040086,2019-02-11,000001,Vente,247000,3,,RUE DE LA FONTAINE,0016,70190,70145,Chaux-la-Lotière,70,,,701450000D0060,,,,,,,,,,,,,0,1,Maison,184,4,S,sols,,,281,5.975886,47.367649
2019-1040086,2019-02-11,000001,Vente,247000,,,LA LOTIERE,B065,70190,70145,Chaux-la-Lotière,70,,,701450000D0061,,,,,,,,,,,,,0,,,,,T,terres,,,2852,5.976367,47.367646
2019-1040266,2019-04-05,000001,Vente,75166,,,LES LONGUES RAYES,B064,70190,70145,Chaux-la-Lotière,70,,,70145000ZC0115,,,,,,,,,,,,,0,,,,,AB,terrains a bâtir,,,1274,5.975519,47.381101
2019-1040407,2019-04-26,000001,Vente,122573.5,4,,IMP DES GRANDES PIECES,0014,70190,70145,Chaux-la-Lotière,70,,,70145000ZE0132,,,,,,,,,,,,,0,1,Maison,85,3,S,sols,,,837,5.973413,47.367031
2019-1040572,2019-05-24,000001,Vente,60000,,,LA BRELE,B004,70190,70145,Chaux-la-Lotière,70,,,701450000A0806,,,,,,,,,,,,,0,,,,,BT,taillis simples,,,1226,5.975886,47.386396
2019-1040572,2019-05-24,000001,Vente,60000,,,LA BRELE,B004,70190,70145,Chaux-la-Lotière,70,,,701450000A0807,,,,,,,,,,,,,0,,,,,AB,terrains a bâtir,,,802,5.976712,47.386424
2019-1040642,2019-05-24,000001,Vente,57000,,,GRANDES PIECES,B059,70190,70145,Chaux-la-Lotière,70,,,70145000ZE0146,,,,,,,,,,,,,0,,,,,AB,terrains a bâtir,,,1000,5.9731,47.368297
2019-1040643,2019-05-24,000001,Vente,271140,10,,RUE DU CORDONNET,0005,70190,70145,Chaux-la-Lotière,70,,,701450000A0088,,,,,,,,,,,,,0,1,Maison,105,5,S,sols,,,1038,5.979138,47.3842
2019-1040643,2019-05-24,000001,Vente,271140,,,LE VILLAGE,B082,70190,70145,Chaux-la-Lotière,70,,,701450000A0089,,,,,,,,,,,,,0,,,,,VE,vergers,,,1435,5.979379,47.383814
2019-1040643,2019-05-24,000001,Vente,271140,,,LES BREULEUX,B005,70190,70145,Chaux-la-Lotière,70,,,701450000A0590,,,,,,,,,,,,,0,,,,,P,prés,,,516,5.978966,47.384242
2019-1040933,2019-07-10,000001,Vente,58000,,,LA COMBE,B031,70190,70145,Chaux-la-Lotière,70,,,70145000ZE0161,,,,,,,,,,,,,0,,,,,AB,terrains a bâtir,,,970,5.972024,47.365884
2019-1040990,2019-07-25,000001,Vente,52845,,,LA COMBE,B031,70190,70145,Chaux-la-Lotière,70,,,70145000ZE0158,,,,,,,,,,,,,0,,,,,AB,terrains a bâtir,,,884,5.972447,47.366246
2019-1041063,2019-07-23,000001,Vente,62000,,,GRANDES PIECES,B059,70190,70145,Chaux-la-Lotière,70,,,70145000ZE0147,,,,,,,,,,,,,0,,,,,T,terres,,,1897,5.97345,47.368654
2019-1041084,2019-08-08,000001,Vente,58000,,,LE VILLAGE,B082,70190,70145,Chaux-la-Lotière,70,,,701450000A0799,,,,,,,,,,,,,0,,,,,AB,terrains a bâtir,,,914,5.979183,47.383187
2019-1041456,2019-09-23,000001,Vente,110000,,,LE VILLAGE,B082,70190,70145,Chaux-la-Lotière,70,,,701450000A0781,,,,,,,,,,,,,0,,,,,P,prés,,,4320,5.979732,47.385079
2019-1041496,2019-10-03,000001,Vente,57000,,,GRANDES PIECES,B059,70190,70145,Chaux-la-Lotière,70,,,70145000ZE0144,,,,,,,,,,,,,0,,,,,AB,terrains a bâtir,,,1000,5.972707,47.367908
2019-1041727,2019-11-29,000001,Vente,1,,,LES COMBES,B040,70190,70145,Chaux-la-Lotière,70,,,70145000ZD0084,,,,,,,,,,,,,0,,,,,AB,terrains a bâtir,,,594,5.975613,47.380274
2019-1041727,2019-11-29,000001,Vente,1,,,LES LONGUES RAYES,B064,70190,70145,Chaux-la-Lotière,70,,,70145000ZC0110,,,,,,,,,,,,,0,,,,,S,sols,,,324,5.975346,47.381678
2019-1041727,2019-11-29,000001,Vente,1,,,LES LONGUES RAYES,B064,70190,70145,Chaux-la-Lotière,70,,,70145000ZC0117,,,,,,,,,,,,,0,,,,,S,sols,,,484,5.974989,47.381136
2019-1041853,2019-11-29,000001,Vente,1,,,LES LONGUES RAYES,B064,70190,70145,Chaux-la-Lotière,70,,,70145000ZC0021,,,,,,,,,,,,,0,,,,,AB,terrains a bâtir,CHEM,Chemin (non groupe),750,5.975381,47.380928
2019-1041916,2019-12-31,000001,Vente,50000,,,LA COMBE,B031,70190,70145,Chaux-la-Lotière,70,,,70145000ZE0163,,,,,,,,,,,,,0,,,,,AB,terrains a bâtir,,,812,5.972439,47.365729
