id_mutation,date_mutation,numero_disposition,nature_mutation,valeur_fonciere,adresse_numero,adresse_suffixe,adresse_nom_voie,adresse_code_voie,code_postal,code_commune,nom_commune,code_departement,ancien_code_commune,ancien_nom_commune,id_parcelle,ancien_id_parcelle,numero_volume,lot1_numero,lot1_surface_carrez,lot2_numero,lot2_surface_carrez,lot3_numero,lot3_surface_carrez,lot4_numero,lot4_surface_carrez,lot5_numero,lot5_surface_carrez,nombre_lots,code_type_local,type_local,surface_reelle_bati,nombre_pieces_principales,code_nature_culture,nature_culture,code_nature_culture_speciale,nature_culture_speciale,surface_terrain,longitude,latitude
2019-1037794,2019-02-16,000001,Vente,195000,,,DERRIERE LES CHAMPS,B035,70270,70295,La Lanterne-et-les-Armonts,70,,,702950000B0146,,,,,,,,,,,,,0,,,,,P,prés,,,3437,6.532295,47.780539
2019-1037794,2019-02-16,000001,Vente,195000,,,DERRIERE LES CHAMPS,B035,70270,70295,La Lanterne-et-les-Armonts,70,,,702950000B0147,,,,,,,,,,,,,0,,,,,VE,vergers,,,2745,6.532783,47.780686
2019-1037794,2019-02-16,000001,Vente,195000,3,,RUE DES CHAMPS,0012,70270,70295,La Lanterne-et-les-Armonts,70,,,702950000B0148,,,,,,,,,,,,,0,1,Maison,112,4,S,sols,,,1092,6.532854,47.780949
2019-1037794,2019-02-16,000001,Vente,195000,,,DERRIERE LES CHAMPS,B035,70270,70295,La Lanterne-et-les-Armonts,70,,,702950000B0149,,,,,,,,,,,,,0,,,,,T,terres,,,4307,6.533536,47.780921
2019-1037868,2019-03-13,000001,Vente,60000,5015,,COROT DU FEU DE BOTEY,B031,70270,70295,La Lanterne-et-les-Armonts,70,,,702950000A1307,,,,,,,,,,,,,0,1,Maison,20,1,S,sols,,,600,6.540108,47.798216
2019-1037868,2019-03-13,000001,Vente,60000,5015,,COROT DU FEU DE BOTEY,B031,70270,70295,La Lanterne-et-les-Armonts,70,,,702950000A1307,,,,,,,,,,,,,0,1,Maison,20,1,E,eaux,,,29365,6.540108,47.798216
2019-1037868,2019-03-13,000001,Vente,60000,,,FEU DE BOTEY,B048,70270,70295,La Lanterne-et-les-Armonts,70,,,702950000A1308,,,,,,,,,,,,,0,,,,,BT,taillis simples,,,2,6.53988,47.797689
2019-1037868,2019-03-13,000001,Vente,60000,,,FEU DE BOTEY,B048,70270,70295,La Lanterne-et-les-Armonts,70,,,702950000A1309,,,,,,,,,,,,,0,,,,,BT,taillis simples,,,65,,
2019-1037868,2019-03-13,000001,Vente,60000,,,FEU DE BOTEY,B048,70270,70295,La Lanterne-et-les-Armonts,70,,,702950000A1310,,,,,,,,,,,,,0,,,,,S,sols,,,99,6.540363,47.797305
2019-1037868,2019-03-13,000001,Vente,60000,,,FEU DE BOTEY,B048,70270,70295,La Lanterne-et-les-Armonts,70,,,702950000A1311,,,,,,,,,,,,,0,,,,,BT,taillis simples,,,63,,
2019-1038693,2019-07-04,000001,Vente,145000,1,,LES CARDOTS,0010,70270,70295,La Lanterne-et-les-Armonts,70,,,702950000B0050,,,,,,,,,,,,,0,1,Maison,108,3,S,sols,,,1695,6.548145,47.780262
2019-1038693,2019-07-04,000001,Vente,145000,1,,LES CARDOTS,0010,70270,70295,La Lanterne-et-les-Armonts,70,,,702950000B0050,,,,,,,,,,,,,0,1,Maison,58,3,S,sols,,,1695,6.548145,47.780262
2019-1038693,2019-07-04,000001,Vente,145000,,,CHEZ LES CARDOTS,B027,70270,70295,La Lanterne-et-les-Armonts,70,,,702950000B0051,,,,,,,,,,,,,0,,,,,BT,taillis simples,,,1070,6.548291,47.779859
2019-1038693,2019-07-04,000001,Vente,145000,,,CHEZ LES CARDOTS,B027,70270,70295,La Lanterne-et-les-Armonts,70,,,702950000B0052,,,,,,,,,,,,,0,,,,,P,prés,,,14705,6.548447,47.780584
2019-1038693,2019-07-04,000001,Vente,145000,,,CHEZ LES CARDOTS,B027,70270,70295,La Lanterne-et-les-Armonts,70,,,702950000B0053,,,,,,,,,,,,,0,,,,,T,terres,,,2690,6.549899,47.77927
2019-1038693,2019-07-04,000001,Vente,145000,,,LE PAUTET,B085,70270,70295,La Lanterne-et-les-Armonts,70,,,702950000B0057,,,,,,,,,,,,,0,,,,,BR,futaies résineuses,,,1660,6.549641,47.778756
2019-1038693,2019-07-04,000001,Vente,145000,,,LE PAUTET,B085,70270,70295,La Lanterne-et-les-Armonts,70,,,702950000B0058,,,,,,,,,,,,,0,,,,,P,prés,,,21415,6.549328,47.778862
2019-1038693,2019-07-04,000001,Vente,145000,,,LE PAUTET,B085,70270,70295,La Lanterne-et-les-Armonts,70,,,702950000B0059,,,,,,,,,,,,,0,,,,,T,terres,,,4810,6.550468,47.777932
2019-1039149,2019-10-11,000001,Vente,2000,,,LE MONT GERARD,B073,70270,70295,La Lanterne-et-les-Armonts,70,,,702950000A0710,,,,,,,,,,,,,0,,,,,BT,taillis simples,,,9465,6.545229,47.789842
2019-1039582,2019-11-30,000002,Vente,1,,,LE MONT GERARD,B073,70270,70295,La Lanterne-et-les-Armonts,70,,,702950000A1322,,,,,,,,,,,,,0,,,,,BR,futaies résineuses,,,213,6.53816,47.786892
2019-1039684,2019-12-17,000001,Vente,5000,,,LES MOUCHENOTS,B074,70270,70295,La Lanterne-et-les-Armonts,70,,,702950000B0440,,,,,,,,,,,,,0,,,,,BR,futaies résineuses,,,2655,6.514087,47.782381
2019-1039684,2019-12-17,000001,Vente,5000,,,LES MOUCHENOTS,B074,70270,70295,La Lanterne-et-les-Armonts,70,,,702950000B0441,,,,,,,,,,,,,0,,,,,BR,futaies résineuses,,,3345,6.51352,47.782094
2019-1039684,2019-12-17,000001,Vente,5000,,,LES MOUCHENOTS,B074,70270,70295,La Lanterne-et-les-Armonts,70,,,702950000B0442,,,,,,,,,,,,,0,,,,,BR,futaies résineuses,,,620,6.513438,47.782053
2019-1039684,2019-12-17,000001,Vente,5000,,,LES MOUCHENOTS,B074,70270,70295,La Lanterne-et-les-Armonts,70,,,702950000B0443,,,,,,,,,,,,,0,,,,,BR,futaies résineuses,,,3475,6.513249,47.781724
2019-1039684,2019-12-17,000001,Vente,5000,,,LES MOUCHENOTS,B074,70270,70295,La Lanterne-et-les-Armonts,70,,,702950000B0444,,,,,,,,,,,,,0,,,,,BT,taillis simples,,,1090,6.512968,47.781574
2019-1039684,2019-12-17,000001,Vente,5000,,,LES MOUCHENOTS,B074,70270,70295,La Lanterne-et-les-Armonts,70,,,702950000B0445,,,,,,,,,,,,,0,,,,,T,terres,,,2845,6.513532,47.781112
2019-1039684,2019-12-17,000001,Vente,5000,,,LES MOUCHENOTS,B074,70270,70295,La Lanterne-et-les-Armonts,70,,,702950000B0445,,,,,,,,,,,,,0,,,,,S,sols,,,1000,6.513532,47.781112
2019-1039695,2019-12-19,000001,Vente,100,,,LA NOYE BRUYERE,B081,70270,70295,La Lanterne-et-les-Armonts,70,,,702950000A0611,,,,,,,,,,,,,0,,,,,L,landes,,,422,6.539862,47.796796
2019-1039695,2019-12-19,000001,Vente,100,,,GRANDES NOUES,B057,70270,70295,La Lanterne-et-les-Armonts,70,,,702950000A1315,,,,,,,,,,,,,0,,,,,L,landes,,,821,6.539153,47.796337
