id_mutation,date_mutation,numero_disposition,nature_mutation,valeur_fonciere,adresse_numero,adresse_suffixe,adresse_nom_voie,adresse_code_voie,code_postal,code_commune,nom_commune,code_departement,ancien_code_commune,ancien_nom_commune,id_parcelle,ancien_id_parcelle,numero_volume,lot1_numero,lot1_surface_carrez,lot2_numero,lot2_surface_carrez,lot3_numero,lot3_surface_carrez,lot4_numero,lot4_surface_carrez,lot5_numero,lot5_surface_carrez,nombre_lots,code_type_local,type_local,surface_reelle_bati,nombre_pieces_principales,code_nature_culture,nature_culture,code_nature_culture_speciale,nature_culture_speciale,surface_terrain,longitude,latitude
2019-1037659,2019-01-25,000001,Vente,1000,,,EN COUAZ,B036,70200,70432,Quers,70,,,704320000A0394,,,,,,,,,,,,,0,,,,,VE,vergers,,,806,6.427027,47.731128
2019-1038439,2019-06-24,000001,Vente,2400,,,COMBE FELOPPE,B026,70200,70432,Quers,70,,,704320000B0050,,,,,,,,,,,,,0,,,,,VE,vergers,,,1408,6.419348,47.74311
2019-1038439,2019-06-24,000001,Vente,2400,,,COMBE FELOPPE,B026,70200,70432,Quers,70,,,704320000B0051,,,,,,,,,,,,,0,,,,,T,terres,,,2785,6.419374,47.743281
2019-1038439,2019-06-24,000001,Vente,2400,,,COMBE FELOPPE,B026,70200,70432,Quers,70,,,704320000B0052,,,,,,,,,,,,,0,,,,,P,prés,,,1492,6.419068,47.743302
2019-1038439,2019-06-24,000001,Vente,2400,,,CONTANTIN,B031,70200,70432,Quers,70,,,704320000B0054,,,,,,,,,,,,,0,,,,,VE,vergers,,,1260,6.419889,47.744229
2019-1038589,2019-07-09,000001,Vente,30000,,,CONTANTIN,B031,70200,70432,Quers,70,,,704320000B0529,,,,,,,,,,,,,0,,,,,P,prés,,,1884,6.420865,47.745186
2019-1038899,2019-08-20,000001,Vente,157000,2,,RUE DU QUERCY,0080,70200,70432,Quers,70,,,704320000D0185,,,,,,,,,,,,,0,1,Maison,105,4,S,sols,,,766,6.424852,47.734934
2019-1039122,2019-10-03,000001,Vente,165,,,LE VILLAGE,B097,70200,70432,Quers,70,,,704320000D0505,,,,,,,,,,,,,0,,,,,S,sols,,,15,6.428495,47.733303
2019-1039146,2019-09-21,000001,Vente,134200,4,,RUE DU STADE,0100,70200,70432,Quers,70,,,704320000C0596,,,,,,,,,,,,,0,1,Maison,119,4,J,jardins,,,3351,6.436172,47.73242
2019-1039146,2019-09-21,000001,Vente,134200,4,,RUE DU STADE,0100,70200,70432,Quers,70,,,704320000C0596,,,,,,,,,,,,,0,1,Maison,119,4,S,sols,,,500,6.436172,47.73242
2019-1039219,2019-10-11,000002,Vente,1,,,LE VILLAGE,B097,70200,70432,Quers,70,,,704320000D0502,,,,,,,,,,,,,0,,,,,S,sols,,,8,6.428447,47.733287
2019-1039219,2019-10-11,000002,Vente,1,,,LE VILLAGE,B097,70200,70432,Quers,70,,,704320000D0503,,,,,,,,,,,,,0,,,,,VE,vergers,,,9,6.428439,47.73323
2019-1039311,2019-10-17,000001,Vente,110000,2,,RUE DU CARREY,0025,70200,70432,Quers,70,,,704320000D0099,,,,,,,,,,,,,0,1,Maison,110,6,S,sols,,,944,6.423058,47.73398
2019-1039311,2019-10-17,000001,Vente,110000,,,LE VILLAGE,B097,70200,70432,Quers,70,,,704320000D0100,,,,,,,,,,,,,0,,,,,J,jardins,,,348,6.423253,47.733911
2019-1039311,2019-10-17,000001,Vente,110000,,,LE VILLAGE,B097,70200,70432,Quers,70,,,704320000D0101,,,,,,,,,,,,,0,,,,,P,prés,,,1234,6.42331,47.734063
