id_mutation,date_mutation,numero_disposition,nature_mutation,valeur_fonciere,adresse_numero,adresse_suffixe,adresse_nom_voie,adresse_code_voie,code_postal,code_commune,nom_commune,code_departement,ancien_code_commune,ancien_nom_commune,id_parcelle,ancien_id_parcelle,numero_volume,lot1_numero,lot1_surface_carrez,lot2_numero,lot2_surface_carrez,lot3_numero,lot3_surface_carrez,lot4_numero,lot4_surface_carrez,lot5_numero,lot5_surface_carrez,nombre_lots,code_type_local,type_local,surface_reelle_bati,nombre_pieces_principales,code_nature_culture,nature_culture,code_nature_culture_speciale,nature_culture_speciale,surface_terrain,longitude,latitude
2019-1042397,2019-05-27,000001,Vente,45900,,,LE VILLAGE,B076,70180,70546,Vereux,70,,,70546000AI0045,,,,,,,,,,,,,0,,,,,S,sols,,,245,5.65293,47.521289
2019-1042397,2019-05-27,000001,Vente,45900,11,,RUE DU MOULIN,0138,70180,70546,Vereux,70,,,70546000AI0279,,,,,,,,,,,,,0,1,Maison,130,6,S,sols,,,397,5.652969,47.521388
2019-1042408,2019-05-27,000001,Vente,80000,,,LE VILLAGE,B076,70180,70546,Vereux,70,,,70546000AI0250,,,,,,,,,,,,,0,,,,,S,sols,,,26,5.647701,47.522906
2019-1042408,2019-05-27,000001,Vente,80000,1,,RUE DU CHATEAU DE PAILLE,0033,70180,70546,Vereux,70,,,70546000AI0251,,,,,,,,,,,,,0,1,Maison,99,4,S,sols,,,583,5.647571,47.522894
2019-1042408,2019-05-27,000001,Vente,80000,,,LE VILLAGE,B076,70180,70546,Vereux,70,,,70546000AI0318,,,,,,,,,,,,,0,,,,,S,sols,,,82,5.647307,47.523065
2019-1042408,2019-05-27,000001,Vente,80000,,,LES MOUROTTES,B057,70180,70546,Vereux,70,,,70546000ZI0023,,,,,,,,,,,,,0,,,,,T,terres,,,3615,5.644304,47.525998
2019-1042843,2019-10-16,000001,Vente,68000,9,,RUE DE LA GARE,0071,70180,70546,Vereux,70,,,70546000AI0134,,,,,,,,,,,,,0,1,Maison,151,5,S,sols,,,337,5.652257,47.518899
2019-1042872,2019-10-15,000001,Vente,700,,,LE VILLAGE,B076,70180,70546,Vereux,70,,,70546000AI0347,,,,,,,,,,,,,0,,,,,T,terres,,,191,5.654285,47.515442
2019-1042872,2019-10-15,000001,Vente,700,,,LES VARENNES,B071,70180,70546,Vereux,70,,,70546000ZM0086,,,,,,,,,,,,,0,,,,,T,terres,,,432,5.654403,47.515434
