id_mutation,date_mutation,numero_disposition,nature_mutation,valeur_fonciere,adresse_numero,adresse_suffixe,adresse_nom_voie,adresse_code_voie,code_postal,code_commune,nom_commune,code_departement,ancien_code_commune,ancien_nom_commune,id_parcelle,ancien_id_parcelle,numero_volume,lot1_numero,lot1_surface_carrez,lot2_numero,lot2_surface_carrez,lot3_numero,lot3_surface_carrez,lot4_numero,lot4_surface_carrez,lot5_numero,lot5_surface_carrez,nombre_lots,code_type_local,type_local,surface_reelle_bati,nombre_pieces_principales,code_nature_culture,nature_culture,code_nature_culture_speciale,nature_culture_speciale,surface_terrain,longitude,latitude
2019-1045939,2019-01-08,000001,Vente,76000,24,,QUAI SAINTE MARIE,7154,71100,71076,Chalon-sur-Saône,71,,,71076000BM0053,,,10,,13,67.21,8,,,,,,3,2,Appartement,80,2,,,,,,4.862754,46.782803
2019-1045947,2019-01-09,000001,Vente,35000,3,,RUE DE BOURGOGNE,1030,71100,71076,Chalon-sur-Saône,71,,,71076000DK0459,,,20,,74,,,,,,,,2,2,Appartement,62,3,,,,,,4.840026,46.789847
2019-1045947,2019-01-09,000001,Vente,35000,3,,RUE DE BOURGOGNE,1030,71100,71076,Chalon-sur-Saône,71,,,71076000DK0459,,,22,59.51,76,,,,,,,,2,2,Appartement,62,3,,,,,,4.840026,46.789847
2019-1045948,2019-01-10,000001,Vente,34000,33,,RUE DU 11 NOVEMBRE 1918,5400,71100,71076,Chalon-sur-Saône,71,,,71076000CM0061,,,43,,98,,,,,,,,2,2,Appartement,38,2,,,,,,4.846441,46.78194
2019-1045953,2019-01-04,000001,Vente,334500,114,,RUE GENERAL GIRAUD,3140,71100,71076,Chalon-sur-Saône,71,,,71076000AS0029,,,,,,,,,,,,,0,1,Maison,227,7,J,jardins,POTAG,Jardin potager,592,4.859467,46.799827
2019-1045953,2019-01-04,000001,Vente,334500,114,,RUE GENERAL GIRAUD,3140,71100,71076,Chalon-sur-Saône,71,,,71076000AS0029,,,,,,,,,,,,,0,1,Maison,227,7,S,sols,,,971,4.859467,46.799827
2019-1045957,2019-01-09,000001,Vente,40000,16,,REM SAINT VINCENT,7100,71100,71076,Chalon-sur-Saône,71,,,71076000CY0122,,,115,52.15,40,,,,,,,,2,2,Appartement,50,2,,,,,,4.854503,46.787149
2019-1045958,2019-01-08,000001,Vente,67030,19,,RUE MAL DE LATTRE DE TASSIGNY,4880,71100,71076,Chalon-sur-Saône,71,,,71076000CW0152,,,101,66.73,119,,,,,,,,2,2,Appartement,67,3,,,,,,4.843517,46.786407
2019-1045964,2019-01-08,000001,Vente,35000,2,,RUE ROGER LAGRANGE,6771,71100,71076,Chalon-sur-Saône,71,,,71076000AY0086,,,118,,54,65.3,,,,,,,2,2,Appartement,66,3,,,,,,4.864898,46.791177
2019-1045967,2019-01-02,000001,Vente,57000,38,,RUE JEAN MOULIN,4190,71100,71076,Chalon-sur-Saône,71,,,71076000CX0198,,,1236,,,,,,,,,,1,3,Dépendance,,0,,,,,,4.8457,46.786499
2019-1045967,2019-01-02,000001,Vente,57000,46,,RUE JEAN MOULIN,4190,71100,71076,Chalon-sur-Saône,71,,,71076000CX0198,,,1006,60.36,1028,,,,,,,,2,2,Appartement,58,3,,,,,,4.8457,46.786499
2019-1045970,2019-01-03,000001,Vente,3000000,14,,RUE GEORGE EASTMAN,3215,71100,71076,Chalon-sur-Saône,71,,,71076000BR0176,,,,,,,,,,,,,0,4,Local industriel. commercial ou assimilé,,,S,sols,,,4115,4.856854,46.766076
2019-1045970,2019-01-03,000001,Vente,3000000,9001,,RUE GEORGE EASTMAN,3215,71100,71076,Chalon-sur-Saône,71,,,71076000BR0182,,,,,,,,,,,,,0,4,Local industriel. commercial ou assimilé,,,S,sols,,,6667,4.857007,46.766568
2019-1045970,2019-01-03,000001,Vente,3000000,,,RUE GEORGE EASTMAN,3215,71100,71076,Chalon-sur-Saône,71,,,71076000BR0183,,,,,,,,,,,,,0,,,,,S,sols,,,481,4.856889,46.766304
2019-1045974,2019-01-11,000001,Vente,91000,5,,CHE DE LA COUDRE,2090,71100,71076,Chalon-sur-Saône,71,,,71076000AM0116,,,2,,4,,7,,8,,,,4,2,Appartement,81,5,,,,,,4.848847,46.799392
2019-1045974,2019-01-11,000001,Vente,91000,3,,CHE DE LA COUDRE,2090,71100,71076,Chalon-sur-Saône,71,,,71076000AM0116,,,201,,,,,,,,,,1,,,,,J,jardins,POTAG,Jardin potager,125,4.848847,46.799392
2019-1045974,2019-01-11,000001,Vente,91000,5,,CHE DE LA COUDRE,2090,71100,71076,Chalon-sur-Saône,71,,,71076000AM0116,,,8,,,,,,,,,,1,3,Dépendance,,0,,,,,,4.848847,46.799392
2019-1045974,2019-01-11,000001,Vente,91000,5,,CHE DE LA COUDRE,2090,71100,71076,Chalon-sur-Saône,71,,,71076000AM0116,,,7,,,,,,,,,,1,3,Dépendance,,0,,,,,,4.848847,46.799392
2019-1045975,2019-01-11,000001,Vente,12500,4,,AV MATHIAS,4930,71100,71076,Chalon-sur-Saône,71,,,71076000BM0207,,,769,,,,,,,,,,1,3,Dépendance,,0,,,,,,4.857959,46.786255
2019-1045978,2019-01-25,000001,Vente,68000,35,,RUE DU CHATELET,1660,71100,71076,Chalon-sur-Saône,71,,,71076000BW0189,,,9,77,,,,,,,,,1,2,Appartement,94,5,,,,,,4.856545,46.781016
2019-1045981,2019-01-12,000001,Vente,18000,34,,AV DE L AUBEPIN,0530,71100,71076,Chalon-sur-Saône,71,,,71076000DP0087,,,252,,,,,,,,,,1,3,Dépendance,,0,,,,,,4.845764,46.795771
2019-1045981,2019-01-12,000001,Vente,18000,34,,AV DE L AUBEPIN,0530,71100,71076,Chalon-sur-Saône,71,,,71076000DP0087,,,158,,,,,,,,,,1,3,Dépendance,,0,,,,,,4.845764,46.795771
2019-1045981,2019-01-12,000001,Vente,18000,34,,AV DE L AUBEPIN,0530,71100,71076,Chalon-sur-Saône,71,,,71076000DP0087,,,145,,,,,,,,,,1,3,Dépendance,,0,,,,,,4.845764,46.795771
2019-1045981,2019-01-12,000001,Vente,18000,34,,AV DE L AUBEPIN,0530,71100,71076,Chalon-sur-Saône,71,,,71076000DP0087,,,146,,,,,,,,,,1,3,Dépendance,,0,,,,,,4.845764,46.795771
2019-1045981,2019-01-12,000001,Vente,18000,34,,AV DE L AUBEPIN,0530,71100,71076,Chalon-sur-Saône,71,,,71076000DP0087,,,149,,,,,,,,,,1,3,Dépendance,,0,,,,,,4.845764,46.795771
2019-1045981,2019-01-12,000001,Vente,18000,34,,AV DE L AUBEPIN,0530,71100,71076,Chalon-sur-Saône,71,,,71076000DP0087,,,147,,,,,,,,,,1,3,Dépendance,,0,,,,,,4.845764,46.795771
2019-1045981,2019-01-12,000001,Vente,18000,34,,AV DE L AUBEPIN,0530,71100,71076,Chalon-sur-Saône,71,,,71076000DP0087,,,148,,,,,,,,,,1,3,Dépendance,,0,,,,,,4.845764,46.795771
2019-1045981,2019-01-12,000001,Vente,18000,34,,AV DE L AUBEPIN,0530,71100,71076,Chalon-sur-Saône,71,,,71076000DP0087,,,200,,,,,,,,,,1,3,Dépendance,,0,,,,,,4.845764,46.795771
2019-1045981,2019-01-12,000001,Vente,18000,34,,AV DE L AUBEPIN,0530,71100,71076,Chalon-sur-Saône,71,,,71076000DP0087,,,199,,,,,,,,,,1,3,Dépendance,,0,,,,,,4.845764,46.795771
2019-1045981,2019-01-12,000001,Vente,18000,34,,AV DE L AUBEPIN,0530,71100,71076,Chalon-sur-Saône,71,,,71076000DP0087,,,198,,,,,,,,,,1,3,Dépendance,,0,,,,,,4.845764,46.795771
2019-1045984,2019-01-04,000001,Vente,76500,1,,PL SAINT JEAN DE MAIZEL,7010,71100,71076,Chalon-sur-Saône,71,,,71076000CL0054,,,90,,,,,,,,,,1,3,Dépendance,,0,,,,,,4.850974,46.778806
2019-1045984,2019-01-04,000001,Vente,76500,38,,QUAI GAMBETTA,3041,71100,71076,Chalon-sur-Saône,71,,,71076000CL0054,,,23,81.79,,,,,,,,,1,2,Appartement,75,3,,,,,,4.850974,46.778806
2019-1045987,2019-01-07,000001,Vente,82000,1,,RUE SARAH BERNHARDT,7163,71100,71076,Chalon-sur-Saône,71,,,71076000AN0427,,,43,78.57,82,,,,,,,,2,2,Appartement,79,4,,,,,,4.856662,46.801114
2019-1045988,2019-01-07,000001,Vente en l'état futur d'achèvement,280000,44,,QUAI SAINT COSME,7111,71100,71076,Chalon-sur-Saône,71,,,71076000CN0058,,,142,,,,,,,,,,1,,,,,,,,,,4.845348,46.775729
2019-1045988,2019-01-07,000001,Vente en l'état futur d'achèvement,280000,44,,QUAI SAINT COSME,7111,71100,71076,Chalon-sur-Saône,71,,,71076000CN0058,,,112,,,,,,,,,,1,,,,,,,,,,4.845348,46.775729
2019-1045995,2019-01-10,000001,Vente,176185,52,,RUE DE STRASBOURG,7330,71100,71076,Chalon-sur-Saône,71,,,71076000BN0127,,,5,,6,,7,,8,,,,4,2,Appartement,115,4,,,,,,4.861443,46.779402
2019-1045995,2019-01-10,000001,Vente,176185,52,,RUE DE STRASBOURG,7330,71100,71076,Chalon-sur-Saône,71,,,71076000BN0127,,,4,,,,,,,,,,1,2,Appartement,2,0,,,,,,4.861443,46.779402
2019-1045995,2019-01-10,000001,Vente,176185,52,A,RUE DE STRASBOURG,7330,71100,71076,Chalon-sur-Saône,71,,,71076000BN0208,,,9,,,,,,,,,,1,3,Dépendance,,0,,,,,,4.861411,46.77929
2019-1045998,2019-01-11,000001,Vente,45000,27,,RUE DENON,2210,71100,71076,Chalon-sur-Saône,71,,,71076000CH0034,,,1,,12,59.45,13,,31,,,,4,2,Appartement,72,3,,,,,,4.851347,46.782219
2019-1045999,2019-01-09,000001,Vente,52000,11,,RUE BOICHOT,0900,71100,71076,Chalon-sur-Saône,71,,,71076000CI0049,,,11,55.05,15,,,,,,,,2,2,Appartement,55,3,,,,,,4.852077,46.781725
2019-1046000,2019-01-15,000001,Vente,24500,15,,REM SAINT PIERRE,7070,71100,71076,Chalon-sur-Saône,71,,,71076000CX0042,,,12,28.9,8,8.05,,,,,,,2,2,Appartement,27,1,,,,,,4.849502,46.785227
2019-1046003,2019-01-25,000001,Vente,40000,5,F,RUE DE LA LIBERTE,4580,71100,71076,Chalon-sur-Saône,71,,,71076000DK0244,,,524,83.16,594,,,,,,,,2,2,Appartement,90,5,,,,,,4.839464,46.789377
2019-1046005,2019-01-24,000001,Vente,105000,7,,RUE DES PLACES,5960,71100,71076,Chalon-sur-Saône,71,,,71076000BZ0029,,,13,,19,70.33,7,,,,,,3,2,Appartement,69,2,,,,,,4.854105,46.786082
2019-1046008,2019-01-12,000001,Vente,290000,18,,RUE PRESIDENT KRUGER,6500,71100,71076,Chalon-sur-Saône,71,,,71076000CX0266,,,11,483.3,,,,,,,,,1,4,Local industriel. commercial ou assimilé,512,0,,,,,,4.84443,46.787839
2019-1046008,2019-01-12,000001,Vente,290000,18,,RUE PRESIDENT KRUGER,6500,71100,71076,Chalon-sur-Saône,71,,,71076000CX0266,,,11,483.3,,,,,,,,,1,4,Local industriel. commercial ou assimilé,627,0,,,,,,4.84443,46.787839
2019-1046010,2019-01-28,000001,Vente,31000,3,,RUE DU PONT,6060,71100,71076,Chalon-sur-Saône,71,,,71076000BW0164,,,12,18.95,,,,,,,,,1,2,Appartement,29,2,,,,,,4.857819,46.781165
2019-1046018,2019-01-04,000001,Vente,28000,18,,RUE DU TEMPLE,7420,71100,71076,Chalon-sur-Saône,71,,,71076000CK0034,,,4,40.16,5,,,,,,,,2,2,Appartement,40,2,,,,,,4.852554,46.780203
2019-1046025,2019-01-29,000001,Vente,54300,18,C,RUE FRANCOIS MANSART,2860,71100,71076,Chalon-sur-Saône,71,,,71076000CX0326,,,18,,8,67.07,,,,,,,2,2,Appartement,67,4,,,,,,4.846463,46.786877
2019-1046034,2019-01-21,000001,Vente,97400,11,,RUE MORINET,5260,71100,71076,Chalon-sur-Saône,71,,,71076000AW0145,,,37,78.3,78,,,,,,,,2,2,Appartement,78,4,,,,,,4.858241,46.791117
2019-1046035,2019-01-18,000001,Vente,100000,5,,AV MONNOT PROLONGEE,5205,71100,71076,Chalon-sur-Saône,71,,,71076000AW0146,,,,,,,,,,,,,0,3,Dépendance,,0,S,sols,,,843,4.861674,46.791518
2019-1046035,2019-01-18,000001,Vente,100000,5,,AV MONNOT PROLONGEE,5205,71100,71076,Chalon-sur-Saône,71,,,71076000AW0146,,,,,,,,,,,,,0,3,Dépendance,,0,S,sols,,,843,4.861674,46.791518
2019-1046035,2019-01-18,000001,Vente,100000,5,,AV MONNOT PROLONGEE,5205,71100,71076,Chalon-sur-Saône,71,,,71076000AW0146,,,,,,,,,,,,,0,3,Dépendance,,0,S,sols,,,843,4.861674,46.791518
2019-1046035,2019-01-18,000001,Vente,100000,5,,AV MONNOT PROLONGEE,5205,71100,71076,Chalon-sur-Saône,71,,,71076000AW0146,,,,,,,,,,,,,0,3,Dépendance,,0,S,sols,,,843,4.861674,46.791518
2019-1046035,2019-01-18,000001,Vente,100000,5,,AV MONNOT PROLONGEE,5205,71100,71076,Chalon-sur-Saône,71,,,71076000AW0146,,,,,,,,,,,,,0,3,Dépendance,,0,S,sols,,,843,4.861674,46.791518
2019-1046035,2019-01-18,000001,Vente,100000,5,,AV MONNOT PROLONGEE,5205,71100,71076,Chalon-sur-Saône,71,,,71076000AW0146,,,,,,,,,,,,,0,3,Dépendance,,0,S,sols,,,843,4.861674,46.791518
2019-1046035,2019-01-18,000001,Vente,100000,5,,AV MONNOT PROLONGEE,5205,71100,71076,Chalon-sur-Saône,71,,,71076000AW0146,,,,,,,,,,,,,0,3,Dépendance,,0,S,sols,,,843,4.861674,46.791518
2019-1046035,2019-01-18,000001,Vente,100000,5,,AV MONNOT PROLONGEE,5205,71100,71076,Chalon-sur-Saône,71,,,71076000AW0146,,,,,,,,,,,,,0,3,Dépendance,,0,S,sols,,,843,4.861674,46.791518
2019-1046035,2019-01-18,000001,Vente,100000,5,,AV MONNOT PROLONGEE,5205,71100,71076,Chalon-sur-Saône,71,,,71076000AW0146,,,,,,,,,,,,,0,3,Dépendance,,0,S,sols,,,843,4.861674,46.791518
2019-1046035,2019-01-18,000001,Vente,100000,5,,AV MONNOT PROLONGEE,5205,71100,71076,Chalon-sur-Saône,71,,,71076000AW0146,,,,,,,,,,,,,0,3,Dépendance,,0,S,sols,,,843,4.861674,46.791518
2019-1046035,2019-01-18,000001,Vente,100000,5,,AV MONNOT PROLONGEE,5205,71100,71076,Chalon-sur-Saône,71,,,71076000AW0146,,,,,,,,,,,,,0,3,Dépendance,,0,S,sols,,,843,4.861674,46.791518
2019-1046035,2019-01-18,000001,Vente,100000,5,,AV MONNOT PROLONGEE,5205,71100,71076,Chalon-sur-Saône,71,,,71076000AW0146,,,,,,,,,,,,,0,3,Dépendance,,0,S,sols,,,843,4.861674,46.791518
2019-1046035,2019-01-18,000001,Vente,100000,5,,AV MONNOT PROLONGEE,5205,71100,71076,Chalon-sur-Saône,71,,,71076000AW0146,,,,,,,,,,,,,0,3,Dépendance,,0,S,sols,,,843,4.861674,46.791518
2019-1046035,2019-01-18,000001,Vente,100000,5,,AV MONNOT PROLONGEE,5205,71100,71076,Chalon-sur-Saône,71,,,71076000AW0146,,,,,,,,,,,,,0,3,Dépendance,,0,S,sols,,,843,4.861674,46.791518
2019-1046035,2019-01-18,000001,Vente,100000,5,,AV MONNOT PROLONGEE,5205,71100,71076,Chalon-sur-Saône,71,,,71076000AW0146,,,,,,,,,,,,,0,3,Dépendance,,0,S,sols,,,843,4.861674,46.791518
2019-1046035,2019-01-18,000001,Vente,100000,5,,AV MONNOT PROLONGEE,5205,71100,71076,Chalon-sur-Saône,71,,,71076000AW0146,,,,,,,,,,,,,0,3,Dépendance,,0,S,sols,,,843,4.861674,46.791518
2019-1046035,2019-01-18,000001,Vente,100000,5,,AV MONNOT PROLONGEE,5205,71100,71076,Chalon-sur-Saône,71,,,71076000AW0146,,,,,,,,,,,,,0,3,Dépendance,,0,S,sols,,,843,4.861674,46.791518
2019-1046035,2019-01-18,000001,Vente,100000,5,,AV MONNOT PROLONGEE,5205,71100,71076,Chalon-sur-Saône,71,,,71076000AW0146,,,,,,,,,,,,,0,3,Dépendance,,0,S,sols,,,843,4.861674,46.791518
2019-1046035,2019-01-18,000001,Vente,100000,5,,AV MONNOT PROLONGEE,5205,71100,71076,Chalon-sur-Saône,71,,,71076000AW0147,,,,,,,,,,,,,0,3,Dépendance,,0,S,sols,,,1283,4.862037,46.791345
2019-1046035,2019-01-18,000001,Vente,100000,5,,AV MONNOT PROLONGEE,5205,71100,71076,Chalon-sur-Saône,71,,,71076000AW0147,,,,,,,,,,,,,0,3,Dépendance,,0,S,sols,,,1283,4.862037,46.791345
2019-1046035,2019-01-18,000001,Vente,100000,5,,AV MONNOT PROLONGEE,5205,71100,71076,Chalon-sur-Saône,71,,,71076000AW0147,,,,,,,,,,,,,0,3,Dépendance,,0,S,sols,,,1283,4.862037,46.791345
2019-1046035,2019-01-18,000001,Vente,100000,5,,AV MONNOT PROLONGEE,5205,71100,71076,Chalon-sur-Saône,71,,,71076000AW0147,,,,,,,,,,,,,0,3,Dépendance,,0,S,sols,,,1283,4.862037,46.791345
2019-1046035,2019-01-18,000001,Vente,100000,5,,AV MONNOT PROLONGEE,5205,71100,71076,Chalon-sur-Saône,71,,,71076000AW0147,,,,,,,,,,,,,0,3,Dépendance,,0,S,sols,,,1283,4.862037,46.791345
2019-1046035,2019-01-18,000001,Vente,100000,5,,AV MONNOT PROLONGEE,5205,71100,71076,Chalon-sur-Saône,71,,,71076000AW0147,,,,,,,,,,,,,0,3,Dépendance,,0,S,sols,,,1283,4.862037,46.791345
2019-1046035,2019-01-18,000001,Vente,100000,5,,AV MONNOT PROLONGEE,5205,71100,71076,Chalon-sur-Saône,71,,,71076000AW0147,,,,,,,,,,,,,0,3,Dépendance,,0,S,sols,,,1283,4.862037,46.791345
2019-1046035,2019-01-18,000001,Vente,100000,5,,AV MONNOT PROLONGEE,5205,71100,71076,Chalon-sur-Saône,71,,,71076000AW0147,,,,,,,,,,,,,0,3,Dépendance,,0,S,sols,,,1283,4.862037,46.791345
2019-1046035,2019-01-18,000001,Vente,100000,5,,AV MONNOT PROLONGEE,5205,71100,71076,Chalon-sur-Saône,71,,,71076000AW0147,,,,,,,,,,,,,0,3,Dépendance,,0,S,sols,,,1283,4.862037,46.791345
2019-1046035,2019-01-18,000001,Vente,100000,5,,AV MONNOT PROLONGEE,5205,71100,71076,Chalon-sur-Saône,71,,,71076000AW0147,,,,,,,,,,,,,0,3,Dépendance,,0,S,sols,,,1283,4.862037,46.791345
2019-1046035,2019-01-18,000001,Vente,100000,5,,AV MONNOT PROLONGEE,5205,71100,71076,Chalon-sur-Saône,71,,,71076000AW0147,,,,,,,,,,,,,0,3,Dépendance,,0,S,sols,,,1283,4.862037,46.791345
2019-1046035,2019-01-18,000001,Vente,100000,5,,AV MONNOT PROLONGEE,5205,71100,71076,Chalon-sur-Saône,71,,,71076000AW0147,,,,,,,,,,,,,0,3,Dépendance,,0,S,sols,,,1283,4.862037,46.791345
2019-1046035,2019-01-18,000001,Vente,100000,5,,AV MONNOT PROLONGEE,5205,71100,71076,Chalon-sur-Saône,71,,,71076000AW0147,,,,,,,,,,,,,0,3,Dépendance,,0,S,sols,,,1283,4.862037,46.791345
2019-1046035,2019-01-18,000001,Vente,100000,5,,AV MONNOT PROLONGEE,5205,71100,71076,Chalon-sur-Saône,71,,,71076000AW0147,,,,,,,,,,,,,0,3,Dépendance,,0,S,sols,,,1283,4.862037,46.791345
2019-1046035,2019-01-18,000001,Vente,100000,5,,AV MONNOT PROLONGEE,5205,71100,71076,Chalon-sur-Saône,71,,,71076000AW0147,,,,,,,,,,,,,0,3,Dépendance,,0,S,sols,,,1283,4.862037,46.791345
2019-1046035,2019-01-18,000001,Vente,100000,5,,AV MONNOT PROLONGEE,5205,71100,71076,Chalon-sur-Saône,71,,,71076000AW0147,,,,,,,,,,,,,0,3,Dépendance,,0,S,sols,,,1283,4.862037,46.791345
2019-1046035,2019-01-18,000001,Vente,100000,5,,AV MONNOT PROLONGEE,5205,71100,71076,Chalon-sur-Saône,71,,,71076000AW0147,,,,,,,,,,,,,0,3,Dépendance,,0,S,sols,,,1283,4.862037,46.791345
2019-1046035,2019-01-18,000001,Vente,100000,5,,AV MONNOT PROLONGEE,5205,71100,71076,Chalon-sur-Saône,71,,,71076000AW0147,,,,,,,,,,,,,0,3,Dépendance,,0,S,sols,,,1283,4.862037,46.791345
2019-1046035,2019-01-18,000001,Vente,100000,5,,AV MONNOT PROLONGEE,5205,71100,71076,Chalon-sur-Saône,71,,,71076000AW0147,,,,,,,,,,,,,0,3,Dépendance,,0,S,sols,,,1283,4.862037,46.791345
2019-1046035,2019-01-18,000001,Vente,100000,5,,AV MONNOT PROLONGEE,5205,71100,71076,Chalon-sur-Saône,71,,,71076000AW0147,,,,,,,,,,,,,0,3,Dépendance,,0,S,sols,,,1283,4.862037,46.791345
2019-1046035,2019-01-18,000001,Vente,100000,5,,AV MONNOT PROLONGEE,5205,71100,71076,Chalon-sur-Saône,71,,,71076000AW0147,,,,,,,,,,,,,0,3,Dépendance,,0,S,sols,,,1283,4.862037,46.791345
2019-1046035,2019-01-18,000001,Vente,100000,5,,AV MONNOT PROLONGEE,5205,71100,71076,Chalon-sur-Saône,71,,,71076000AW0147,,,,,,,,,,,,,0,3,Dépendance,,0,S,sols,,,1283,4.862037,46.791345
2019-1046035,2019-01-18,000001,Vente,100000,5,,AV MONNOT PROLONGEE,5205,71100,71076,Chalon-sur-Saône,71,,,71076000AW0147,,,,,,,,,,,,,0,3,Dépendance,,0,S,sols,,,1283,4.862037,46.791345
2019-1046035,2019-01-18,000001,Vente,100000,5,,AV MONNOT PROLONGEE,5205,71100,71076,Chalon-sur-Saône,71,,,71076000AW0147,,,,,,,,,,,,,0,3,Dépendance,,0,S,sols,,,1283,4.862037,46.791345
2019-1046035,2019-01-18,000001,Vente,100000,5,,AV MONNOT PROLONGEE,5205,71100,71076,Chalon-sur-Saône,71,,,71076000AW0147,,,,,,,,,,,,,0,3,Dépendance,,0,S,sols,,,1283,4.862037,46.791345
2019-1046035,2019-01-18,000001,Vente,100000,5,,AV MONNOT PROLONGEE,5205,71100,71076,Chalon-sur-Saône,71,,,71076000AW0147,,,,,,,,,,,,,0,3,Dépendance,,0,S,sols,,,1283,4.862037,46.791345
2019-1046035,2019-01-18,000001,Vente,100000,5,,AV MONNOT PROLONGEE,5205,71100,71076,Chalon-sur-Saône,71,,,71076000AW0147,,,,,,,,,,,,,0,3,Dépendance,,0,S,sols,,,1283,4.862037,46.791345
2019-1046035,2019-01-18,000001,Vente,100000,5,,AV MONNOT PROLONGEE,5205,71100,71076,Chalon-sur-Saône,71,,,71076000AW0147,,,,,,,,,,,,,0,3,Dépendance,,0,S,sols,,,1283,4.862037,46.791345
2019-1046035,2019-01-18,000001,Vente,100000,5,,AV MONNOT PROLONGEE,5205,71100,71076,Chalon-sur-Saône,71,,,71076000AW0147,,,,,,,,,,,,,0,3,Dépendance,,0,S,sols,,,1283,4.862037,46.791345
2019-1046035,2019-01-18,000001,Vente,100000,5,,AV MONNOT PROLONGEE,5205,71100,71076,Chalon-sur-Saône,71,,,71076000AW0147,,,,,,,,,,,,,0,3,Dépendance,,0,S,sols,,,1283,4.862037,46.791345
2019-1046035,2019-01-18,000001,Vente,100000,5,,AV MONNOT PROLONGEE,5205,71100,71076,Chalon-sur-Saône,71,,,71076000AW0147,,,,,,,,,,,,,0,3,Dépendance,,0,S,sols,,,1283,4.862037,46.791345
2019-1046035,2019-01-18,000001,Vente,100000,5,,AV MONNOT PROLONGEE,5205,71100,71076,Chalon-sur-Saône,71,,,71076000AW0147,,,,,,,,,,,,,0,3,Dépendance,,0,S,sols,,,1283,4.862037,46.791345
2019-1046035,2019-01-18,000001,Vente,100000,5,,AV MONNOT PROLONGEE,5205,71100,71076,Chalon-sur-Saône,71,,,71076000AW0147,,,,,,,,,,,,,0,3,Dépendance,,0,S,sols,,,1283,4.862037,46.791345
2019-1046035,2019-01-18,000001,Vente,100000,5,,AV MONNOT PROLONGEE,5205,71100,71076,Chalon-sur-Saône,71,,,71076000AW0147,,,,,,,,,,,,,0,3,Dépendance,,0,S,sols,,,1283,4.862037,46.791345
2019-1046035,2019-01-18,000001,Vente,100000,5,,AV MONNOT PROLONGEE,5205,71100,71076,Chalon-sur-Saône,71,,,71076000AW0147,,,,,,,,,,,,,0,3,Dépendance,,0,S,sols,,,1283,4.862037,46.791345
2019-1046035,2019-01-18,000001,Vente,100000,5,,AV MONNOT PROLONGEE,5205,71100,71076,Chalon-sur-Saône,71,,,71076000AW0147,,,,,,,,,,,,,0,3,Dépendance,,0,S,sols,,,1283,4.862037,46.791345
2019-1046035,2019-01-18,000001,Vente,100000,5,,AV MONNOT PROLONGEE,5205,71100,71076,Chalon-sur-Saône,71,,,71076000AW0147,,,,,,,,,,,,,0,3,Dépendance,,0,S,sols,,,1283,4.862037,46.791345
2019-1046035,2019-01-18,000001,Vente,100000,5,,AV MONNOT PROLONGEE,5205,71100,71076,Chalon-sur-Saône,71,,,71076000AW0147,,,,,,,,,,,,,0,3,Dépendance,,0,S,sols,,,1283,4.862037,46.791345
2019-1046035,2019-01-18,000001,Vente,100000,5,,AV MONNOT PROLONGEE,5205,71100,71076,Chalon-sur-Saône,71,,,71076000AW0147,,,,,,,,,,,,,0,3,Dépendance,,0,S,sols,,,1283,4.862037,46.791345
2019-1046035,2019-01-18,000001,Vente,100000,5,,AV MONNOT PROLONGEE,5205,71100,71076,Chalon-sur-Saône,71,,,71076000AW0147,,,,,,,,,,,,,0,3,Dépendance,,0,S,sols,,,1283,4.862037,46.791345
2019-1046035,2019-01-18,000001,Vente,100000,5,,AV MONNOT PROLONGEE,5205,71100,71076,Chalon-sur-Saône,71,,,71076000AW0147,,,,,,,,,,,,,0,3,Dépendance,,0,S,sols,,,1283,4.862037,46.791345
2019-1046035,2019-01-18,000001,Vente,100000,5,,AV MONNOT PROLONGEE,5205,71100,71076,Chalon-sur-Saône,71,,,71076000AW0147,,,,,,,,,,,,,0,3,Dépendance,,0,S,sols,,,1283,4.862037,46.791345
2019-1046036,2019-01-22,000001,Vente,149000,14,,RUE ST MARTIN DES CHAMPS,7060,71100,71076,Chalon-sur-Saône,71,,,71076000AV0061,,,,,,,,,,,,,0,1,Maison,97,6,S,sols,,,633,4.855748,46.793713
2019-1046042,2019-01-18,000001,Vente,27000,56,C,RUE DES LIEUTENANTS CHAUVEAU,4620,71100,71076,Chalon-sur-Saône,71,,,71076000CO0180,,,125,,170,51.56,,,,,,,2,2,Appartement,51,3,,,,,,4.836268,46.780029
2019-1046044,2019-01-03,000001,Vente,35000,6,,QUAI SAINT COSME,7111,71100,71076,Chalon-sur-Saône,71,,,71076000CL0149,,,138,,159,58.83,,,,,,,2,2,Appartement,61,2,,,,,,4.849866,46.778066
2019-1046045,2019-01-04,000001,Vente,39000,1,,AV BOUCICAUT,1010,71100,71076,Chalon-sur-Saône,71,,,71076000CW0054,,,14,40.6,,,,,,,,,1,2,Appartement,42,2,,,,,,4.846328,46.783138
2019-1046050,2019-01-09,000001,Vente,70000,14,,RUE PASTEUR,5580,71100,71076,Chalon-sur-Saône,71,,,71076000CI0123,,,1,,4,,,,,,,,2,4,Local industriel. commercial ou assimilé,72,0,,,,,,4.851585,46.780321
2019-1046050,2019-01-09,000001,Vente,70000,16,,RUE PASTEUR,5580,71100,71076,Chalon-sur-Saône,71,,,71076000CI0124,,,2,,,,,,,,,,1,4,Local industriel. commercial ou assimilé,84,0,,,,,,4.851518,46.780284
2019-1046051,2019-01-09,000001,Vente,59500,10,,IMP MONOCLAIR,5180,71100,71076,Chalon-sur-Saône,71,,,71076000AW0104,,,3,80.92,31,,59,,,,,,3,2,Appartement,81,5,,,,,,4.862107,46.793072
2019-1046061,2019-01-25,000001,Vente,5700,7,,RUE DES GLYCINES,3380,71100,71076,Chalon-sur-Saône,71,,,71076000DH0314,,,4,,,,,,,,,,1,3,Dépendance,,0,,,,,,4.846068,46.793838
2019-1046064,2019-01-31,000001,Vente,12500,11,,RUE CLEMENT ADER,1780,71100,71076,Chalon-sur-Saône,71,,,71076000AX0303,,,99,,,,,,,,,,1,3,Dépendance,,0,,,,,,4.860157,46.790844
2019-1046066,2019-01-11,000001,Vente,189000,31,,RUE DE NOVARA,5342,71100,71076,Chalon-sur-Saône,71,,,71076000AS0399,,,,,,,,,,,,,0,1,Maison,104,4,S,sols,,,174,4.858979,46.796072
2019-1046067,2019-01-10,000001,Vente,87000,7,T,AV NICEPHORE NIEPCE,5320,71100,71076,Chalon-sur-Saône,71,,,71076000CM0110,,,20,,51,,,,,,,,2,2,Appartement,110,5,,,,,,4.84869,46.779983
2019-1046071,2019-01-24,000001,Vente,30000,4,,RUE LESCHENAULT LA TOUR,4540,71100,71076,Chalon-sur-Saône,71,,,71076000CX0300,,,25,,34,35,,,,,,,2,2,Appartement,70,3,,,,,,4.849641,46.7885
2019-1046080,2019-02-04,000001,Vente,39000,18,,PL DE LA REPUBLIQUE,6730,71100,71076,Chalon-sur-Saône,71,,,71076000CX0273,,,14,,40,,7,,,,,,3,2,Appartement,50,2,,,,,,4.847246,46.783422
2019-1046091,2019-01-11,000001,Vente,90000,74,,RUE DU BOIS DE MENUSE,0940,71100,71076,Chalon-sur-Saône,71,,,71076000AN0169,,,,,,,,,,,,,0,1,Maison,77,2,S,sols,,,637,4.8538,46.804826
2019-1046100,2019-01-07,000001,Vente,1,,,RUE DES LIEUTENANTS CHAUVEAU,4620,71100,71076,Chalon-sur-Saône,71,,,71076000CP0246,,,,,,,,,,,,,0,,,,,AG,terrains d'agrément,,,569,4.838544,46.776655
2019-1046100,2019-01-07,000001,Vente,1,,,PRES DEVANT,B069,71100,71076,Chalon-sur-Saône,71,,,71076000CP0252,,,,,,,,,,,,,0,,,,,E,eaux,,,113,4.838386,46.776517
2019-1046100,2019-01-07,000001,Vente,1,,,PRES DEVANT,B069,71100,71076,Chalon-sur-Saône,71,,,71076000CP0253,,,,,,,,,,,,,0,,,,,E,eaux,,,3201,4.839393,46.776301
2019-1046100,2019-01-07,000001,Vente,1,,,RUE DES LIEUTENANTS CHAUVEAU,4620,71100,71076,Chalon-sur-Saône,71,,,71076000CP0257,,,,,,,,,,,,,0,,,,,E,eaux,,,1197,4.838838,46.776626