id_mutation,date_mutation,numero_disposition,nature_mutation,valeur_fonciere,adresse_numero,adresse_suffixe,adresse_nom_voie,adresse_code_voie,code_postal,code_commune,nom_commune,code_departement,ancien_code_commune,ancien_nom_commune,id_parcelle,ancien_id_parcelle,numero_volume,lot1_numero,lot1_surface_carrez,lot2_numero,lot2_surface_carrez,lot3_numero,lot3_surface_carrez,lot4_numero,lot4_surface_carrez,lot5_numero,lot5_surface_carrez,nombre_lots,code_type_local,type_local,surface_reelle_bati,nombre_pieces_principales,code_nature_culture,nature_culture,code_nature_culture_speciale,nature_culture_speciale,surface_terrain,longitude,latitude
2019-1050132,2019-01-03,000001,Vente,500,,,LES TETES,B080,71220,71524,Sivignon,71,,,715240000F0233,,,,,,,,,,,,,0,,,,,BR,futaies résineuses,,,4718,4.480948,46.41644
2019-1050527,2019-02-26,000001,Vente,400,,,LE HAUT DES BRUYERES,B050,71220,71524,Sivignon,71,,,715240000E0037,,,,,,,,,,,,,0,,,,,BR,futaies résineuses,,,3807,4.514288,46.421262
2019-1050712,2019-04-10,000002,Vente,1500,,,LES MOREAUX,B061,71220,71524,Sivignon,71,,,71524000AD0139,,,,,,,,,,,,,0,,,,,P,prés,,,1096,4.499693,46.416332
2019-1050773,2019-05-07,000002,Vente,2300,,,LA FORET,B040,71220,71524,Sivignon,71,,,715240000F0272,,,,,,,,,,,,,0,,,,,BT,taillis simples,,,1606,4.489979,46.420667
2019-1051039,2019-05-29,000001,Vente,2700,,,FRATEUSSAT,B042,71220,71524,Sivignon,71,,,715240000E0141,,,,,,,,,,,,,0,,,,,P,prés,,,1898,4.509139,46.405888
2019-1051039,2019-05-29,000001,Vente,2700,,,FRATEUSSAT,B042,71220,71524,Sivignon,71,,,715240000E0150,,,,,,,,,,,,,0,,,,,T,terres,,,6619,4.508271,46.405794
2019-1051039,2019-05-29,000001,Vente,2700,,,FRATEUSSAT,B042,71220,71524,Sivignon,71,,,715240000E0151,,,,,,,,,,,,,0,,,,,T,terres,,,2740,4.508232,46.40492
2019-1051039,2019-05-29,000001,Vente,2700,,,FRATEUSSAT,B042,71220,71524,Sivignon,71,,,715240000E0152,,,,,,,,,,,,,0,,,,,T,terres,,,2560,4.507838,46.404781
2019-1051108,2019-06-06,000001,Vente,12000,,,LE BOURG,B010,71220,71524,Sivignon,71,,,71524000AB0057,,,,,,,,,,,,,0,,,,,S,sols,,,232,4.499707,46.427287
2019-1051278,2019-07-05,000001,Vente,20,,,LES CHASSIGNOLES,B021,71220,71524,Sivignon,71,,,715240000E0671,,,,,,,,,,,,,0,,,,,L,landes,FRICH,Friche,55,4.507776,46.41248
2019-1051279,2019-07-05,000002,Vente,150,,,LES CHASSIGNOLES,B021,71220,71524,Sivignon,71,,,715240000E0672,,,,,,,,,,,,,0,,,,,L,landes,FRICH,Friche,408,,
2019-1051284,2019-07-12,000001,Vente,135000,5039,,LAURANDON,B052,71220,71524,Sivignon,71,,,715240000E0254,,,,,,,,,,,,,0,1,Maison,96,5,S,sols,,,1081,4.508104,46.412645
2019-1051284,2019-07-12,000001,Vente,135000,,,LES CHASSIGNOLES,B021,71220,71524,Sivignon,71,,,715240000E0255,,,,,,,,,,,,,0,,,,,P,prés,,,1085,4.508083,46.412896
2019-1051284,2019-07-12,000001,Vente,135000,,,LES CHASSIGNOLES,B021,71220,71524,Sivignon,71,,,715240000E0256,,,,,,,,,,,,,0,,,,,T,terres,,,2298,4.507592,46.412663
2019-1051284,2019-07-12,000001,Vente,135000,,,LES CHASSIGNOLES,B021,71220,71524,Sivignon,71,,,715240000E0669,,,,,,,,,,,,,0,,,,,P,prés,,,28,4.50814,46.412494
2019-1051284,2019-07-12,000001,Vente,135000,,,LES CHASSIGNOLES,B021,71220,71524,Sivignon,71,,,715240000E0672,,,,,,,,,,,,,0,,,,,L,landes,FRICH,Friche,408,,
2019-1051430,2019-07-19,000002,Vente,165638.92,,,LES CHASSIGNOLES,B021,71220,71524,Sivignon,71,,,715240000E0241,,,,,,,,,,,,,0,,,,,P,prés,,,3895,4.503166,46.411393
2019-1051430,2019-07-19,000002,Vente,165638.92,,,LES CHASSIGNOLES,B021,71220,71524,Sivignon,71,,,715240000E0242,,,,,,,,,,,,,0,,,,,P,prés,,,2284,4.502477,46.411471
2019-1051430,2019-07-19,000002,Vente,165638.92,,,AUX AUGERES,B002,71220,71524,Sivignon,71,,,715240000F0091,,,,,,,,,,,,,0,,,,,P,prés,,,8858,4.497995,46.412373
2019-1051430,2019-07-19,000002,Vente,165638.92,,,AUX AUGERES,B002,71220,71524,Sivignon,71,,,715240000F0092,,,,,,,,,,,,,0,,,,,P,prés,,,5384,4.499427,46.412803
2019-1051430,2019-07-19,000002,Vente,165638.92,,,AUX AUGERES,B002,71220,71524,Sivignon,71,,,715240000F0093,,,,,,,,,,,,,0,,,,,P,prés,,,8898,4.499109,46.413273
2019-1051430,2019-07-19,000002,Vente,165638.92,,,EN MONLOIX,B060,71220,71524,Sivignon,71,,,715240000F0111,,,,,,,,,,,,,0,,,,,T,terres,,,5610,4.49897,46.411647
2019-1051430,2019-07-19,000002,Vente,165638.92,,,EN MONLOIX,B060,71220,71524,Sivignon,71,,,715240000F0111,,,,,,,,,,,,,0,,,,,S,sols,,,3300,4.49897,46.411647
2019-1051430,2019-07-19,000002,Vente,165638.92,,,EN MONLOIX,B060,71220,71524,Sivignon,71,,,715240000F0120,,,,,,,,,,,,,0,,,,,T,terres,,,16482,4.49685,46.410962
2019-1051430,2019-07-19,000002,Vente,165638.92,,,EN MONLOIX,B060,71220,71524,Sivignon,71,,,715240000F0121,,,,,,,,,,,,,0,,,,,T,terres,,,1517,4.495719,46.410652
2019-1051430,2019-07-19,000002,Vente,165638.92,,,EN MONLOIX,B060,71220,71524,Sivignon,71,,,715240000F0125,,,,,,,,,,,,,0,,,,,T,terres,,,6496,4.49569,46.408792
2019-1051430,2019-07-19,000002,Vente,165638.92,,,EN MONLOIX,B060,71220,71524,Sivignon,71,,,715240000F0126,,,,,,,,,,,,,0,,,,,P,prés,,,734,4.496493,46.408645
2019-1051430,2019-07-19,000002,Vente,165638.92,,,EN MONLOIX,B060,71220,71524,Sivignon,71,,,715240000F0127,,,,,,,,,,,,,0,,,,,P,prés,,,20677,4.496302,46.409423
2019-1051430,2019-07-19,000002,Vente,165638.92,,,EN MONLOIX,B060,71220,71524,Sivignon,71,,,715240000F0128,,,,,,,,,,,,,0,,,,,P,prés,,,4931,4.496451,46.409513
2019-1051430,2019-07-19,000002,Vente,165638.92,,,EN MONLOIX,B060,71220,71524,Sivignon,71,,,715240000F0129,,,,,,,,,,,,,0,,,,,S,sols,,,243,4.497016,46.409647
2019-1051430,2019-07-19,000002,Vente,165638.92,,,EN MONLOIX,B060,71220,71524,Sivignon,71,,,715240000F0130,,,,,,,,,,,,,0,,,,,P,prés,,,11114,4.497328,46.409521
2019-1051430,2019-07-19,000002,Vente,165638.92,,,EN MONLOIX,B060,71220,71524,Sivignon,71,,,715240000F0131,,,,,,,,,,,,,0,,,,,P,prés,,,9892,4.49844,46.410703
2019-1051430,2019-07-19,000002,Vente,165638.92,,,EN MONLOIX,B060,71220,71524,Sivignon,71,,,715240000F0131,,,,,,,,,,,,,0,,,,,P,prés,,,9892,4.49844,46.410703
2019-1051430,2019-07-19,000002,Vente,165638.92,,,EN MONLOIX,B060,71220,71524,Sivignon,71,,,715240000F0132,,,,,,,,,,,,,0,,,,,BT,taillis simples,,,5006,4.498756,46.410128
2019-1051430,2019-07-19,000002,Vente,165638.92,,,A LA LIE,B053,71220,71524,Sivignon,71,,,715240000F0143,,,,,,,,,,,,,0,,,,,T,terres,,,7975,4.496903,46.407652
2019-1051430,2019-07-19,000002,Vente,165638.92,,,A LA LIE,B053,71220,71524,Sivignon,71,,,715240000F0144,,,,,,,,,,,,,0,,,,,T,terres,,,7881,4.496277,46.407979
2019-1051430,2019-07-19,000002,Vente,165638.92,,,A LA LIE,B053,71220,71524,Sivignon,71,,,715240000F0145,,,,,,,,,,,,,0,,,,,T,terres,,,3950,4.495828,46.408047
2019-1051430,2019-07-19,000002,Vente,165638.92,,,CHAMP DE TRIVY,B017,71220,71524,Sivignon,71,,,715240000F0146,,,,,,,,,,,,,0,,,,,T,terres,,,6400,4.495475,46.407472
2019-1051430,2019-07-19,000002,Vente,165638.92,,,A LA LIE,B053,71220,71524,Sivignon,71,,,715240000F0327,,,,,,,,,,,,,0,,,,,P,prés,,,866,4.498229,46.409221
2019-1051430,2019-07-19,000002,Vente,165638.92,,,A LA LIE,B053,71220,71524,Sivignon,71,,,715240000F0351,,,,,,,,,,,,,0,,,,,P,prés,,,7370,4.498585,46.408908
2019-1051430,2019-07-19,000002,Vente,165638.92,,,EN MONLOIX,B060,71220,71524,Sivignon,71,,,715240000F0359,,,,,,,,,,,,,0,,,,,T,terres,,,657,4.499323,46.411449
2019-1051452,2019-08-02,000001,Vente,71600,,,LE BOURG,B010,71220,71524,Sivignon,71,,,71524000AB0046,,,,,,,,,,,,,0,,,,,J,jardins,POTAG,Jardin potager,1318,4.501407,46.42648
2019-1051452,2019-08-02,000001,Vente,71600,5113,,LE BOURG,B010,71220,71524,Sivignon,71,,,71524000AB0047,,,,,,,,,,,,,0,1,Maison,40,2,S,sols,,,561,4.501424,46.426819
2019-1051873,2019-10-04,000001,Vente,197000,,,LE MARTRAT,B057,71220,71524,Sivignon,71,,,71524000AD0009,,,,,,,,,,,,,0,,,,,P,prés,,,16570,4.499723,46.419226
2019-1051873,2019-10-04,000001,Vente,197000,5051,,LE MARTRAT,B057,71220,71524,Sivignon,71,,,71524000AD0010,,,,,,,,,,,,,0,1,Maison,75,2,S,sols,,,1695,4.500933,46.419873
2019-1051950,2019-10-24,000001,Vente,3000,,,NIALIN,B058,71220,71524,Sivignon,71,,,715240000C0085,,,,,,,,,,,,,0,,,,,BR,futaies résineuses,,,22290,4.492804,46.446133
2019-1051950,2019-10-24,000001,Vente,3000,,,NIALIN,B058,71220,71524,Sivignon,71,,,715240000C0086,,,,,,,,,,,,,0,,,,,T,terres,,,5976,4.492575,46.445813
2019-1051951,2019-10-24,000001,Vente,6500,,,VEAUX,B082,71220,71524,Sivignon,71,,,715240000D0074,,,,,,,,,,,,,0,,,,,BT,taillis simples,,,1435,4.494706,46.438983
2019-1051951,2019-10-24,000001,Vente,6500,,,VEAUX,B082,71220,71524,Sivignon,71,,,715240000D0075,,,,,,,,,,,,,0,,,,,P,prés,,,13655,4.494951,46.438236
2019-1051951,2019-10-24,000001,Vente,6500,,,VEAUX,B082,71220,71524,Sivignon,71,,,715240000D0076,,,,,,,,,,,,,0,,,,,J,jardins,POTAG,Jardin potager,239,4.495399,46.437595
2019-1051951,2019-10-24,000001,Vente,6500,,,CHATEAU DE VEAUX,B023,71220,71524,Sivignon,71,,,715240000D0150,,,,,,,,,,,,,0,,,,,P,prés,,,13862,4.49311,46.439086
2019-1051951,2019-10-24,000001,Vente,6500,,,CHATEAU DE VEAUX,B023,71220,71524,Sivignon,71,,,715240000D0151,,,,,,,,,,,,,0,,,,,P,prés,,,18705,4.492257,46.439933
