id_mutation,date_mutation,numero_disposition,nature_mutation,valeur_fonciere,adresse_numero,adresse_suffixe,adresse_nom_voie,adresse_code_voie,code_postal,code_commune,nom_commune,code_departement,ancien_code_commune,ancien_nom_commune,id_parcelle,ancien_id_parcelle,numero_volume,lot1_numero,lot1_surface_carrez,lot2_numero,lot2_surface_carrez,lot3_numero,lot3_surface_carrez,lot4_numero,lot4_surface_carrez,lot5_numero,lot5_surface_carrez,nombre_lots,code_type_local,type_local,surface_reelle_bati,nombre_pieces_principales,code_nature_culture,nature_culture,code_nature_culture_speciale,nature_culture_speciale,surface_terrain,longitude,latitude
2019-1067917,2019-05-29,000001,Vente,62000,,,LE LOGIS DES BIARDS,B177,72600,72086,Commerveil,72,,,720860000A0467,,,,,,,,,,,,,0,,,,,S,sols,,,86,0.349267,48.308068
2019-1067917,2019-05-29,000001,Vente,62000,,,LA PREE,B280,72600,72086,Commerveil,72,,,720860000A0469,,,,,,,,,,,,,0,,,,,S,sols,,,158,0.349043,48.308154
2019-1067917,2019-05-29,000001,Vente,62000,5062,,LE LOGIS DES BIARDS,B177,72600,72086,Commerveil,72,,,720860000A0471,,,,,,,,,,,,,0,1,Maison,150,3,S,sols,,,823,0.349039,48.308028
2019-1067921,2019-06-07,000001,Vente,240000,,,LA MARE,B185,72600,72086,Commerveil,72,,,720860000A0453,,,,,,,,,,,,,0,,,,,T,terres,,,633,0.348164,48.307691
2019-1067921,2019-06-07,000001,Vente,240000,5052,,LE LOGIS DES BIARDS,B177,72600,72086,Commerveil,72,,,720860000A0455,,,,,,,,,,,,,0,1,Maison,169,6,S,sols,,,1857,0.348896,48.307592
2019-1067921,2019-06-07,000001,Vente,240000,,,LA PREE,B280,72600,72086,Commerveil,72,,,720860000A0457,,,,,,,,,,,,,0,,,,,S,sols,,,63,0.349291,48.307846
2019-1067921,2019-06-07,000001,Vente,240000,,,LA PREE,B280,72600,72086,Commerveil,72,,,720860000A0483,,,,,,,,,,,,,0,,,,,S,sols,,,146,0.34916,48.307904
2019-1067921,2019-06-07,000001,Vente,240000,,,LA PREE,B280,72600,72086,Commerveil,72,,,720860000A0569,,,,,,,,,,,,,0,,,,,T,terres,,,1227,0.348858,48.307426
2019-1067921,2019-06-07,000001,Vente,240000,,,LA COUR DES BIARDS,B109,72600,72086,Commerveil,72,,,720860000A0572,,,,,,,,,,,,,0,,,,,AG,terrains d'agrément,,,480,0.348493,48.307307
2019-1068001,2019-07-03,000001,Vente,15750,,,LE CLOS,B090,72600,72086,Commerveil,72,,,720860000A0057,,,,,,,,,,,,,0,,,,,T,terres,,,2750,0.343406,48.316691
2019-1068001,2019-07-03,000001,Vente,15750,5009,,LES HAUTES ANGES,B165,72600,72086,Commerveil,72,,,720860000A0075,,,,,,,,,,,,,0,1,Maison,70,2,S,sols,,,1937,0.343908,48.316774
2019-1068001,2019-07-03,000001,Vente,15750,,,LE CLOS DE LA MARELLERIE,B097,72600,72086,Commerveil,72,,,720860000A0077,,,,,,,,,,,,,0,,,,,S,sols,,,15,0.344112,48.317044
2019-1068001,2019-07-03,000001,Vente,15750,,,LE CLOS DE LA MARELLERIE,B097,72600,72086,Commerveil,72,,,720860000A0077,,,,,,,,,,,,,0,,,,,P,prés,,,1420,0.344112,48.317044
2019-1068001,2019-07-03,000001,Vente,15750,,,LES ANGES,B001,72600,72086,Commerveil,72,,,720860000A0078,,,,,,,,,,,,,0,,,,,P,prés,,,11168,0.345239,48.316413
2019-1068001,2019-07-03,000001,Vente,15750,,,LES ANGES,B001,72600,72086,Commerveil,72,,,720860000A0079,,,,,,,,,,,,,0,,,,,P,prés,,,4127,0.347102,48.315651
2019-1068001,2019-07-03,000001,Vente,15750,,,LE GRAND PARC,B143,72600,72086,Commerveil,72,,,720860000A0081,,,,,,,,,,,,,0,,,,,P,prés,,,8130,0.346487,48.316389
2019-1068001,2019-07-03,000001,Vente,15750,,,LE GRAND PARC,B143,72600,72086,Commerveil,72,,,720860000A0082,,,,,,,,,,,,,0,,,,,P,prés,,,9820,0.34498,48.317172
2019-1068006,2019-06-20,000001,Vente,5760,,,LES BIARDS,B013,72600,72086,Commerveil,72,,,720860000A0288,,,,,,,,,,,,,0,,,,,T,terres,,,7200,0.345934,48.305891
2019-1068542,2019-10-18,000001,Vente,117000,,,LE CLOS DE DERRIERE,B093,72600,72086,Commerveil,72,,,720860000A0174,,,,,,,,,,,,,0,,,,,P,prés,,,5597,0.354187,48.319389
2019-1068542,2019-10-18,000001,Vente,117000,16,,RUE DE LA CHARMILLE,0030,72600,72086,Commerveil,72,,,720860000A0175,,,,,,,,,,,,,0,1,Maison,80,3,S,sols,,,1530,0.354478,48.319142
2019-1068542,2019-10-18,000001,Vente,117000,,,RUE DE LA CHARMILLE,0030,72600,72086,Commerveil,72,,,720860000A0176,,,,,,,,,,,,,0,,,,,J,jardins,,,543,0.354605,48.319001
2019-1068750,2019-11-04,000001,Vente,50162,,,PRE GIRARD,B276,72600,72086,Commerveil,72,,,72086000ZE0006,,,,,,,,,,,,,0,,,,,P,prés,,,10661,0.340294,48.30653
2019-1068750,2019-11-04,000001,Vente,50162,,,LA GOBILLONNIERE,B134,72600,72086,Commerveil,72,,,72086000ZE0008,,,,,,,,,,,,,0,,,,,P,prés,,,72942,0.342265,48.306428
