id_mutation,date_mutation,numero_disposition,nature_mutation,valeur_fonciere,adresse_numero,adresse_suffixe,adresse_nom_voie,adresse_code_voie,code_postal,code_commune,nom_commune,code_departement,ancien_code_commune,ancien_nom_commune,id_parcelle,ancien_id_parcelle,numero_volume,lot1_numero,lot1_surface_carrez,lot2_numero,lot2_surface_carrez,lot3_numero,lot3_surface_carrez,lot4_numero,lot4_surface_carrez,lot5_numero,lot5_surface_carrez,nombre_lots,code_type_local,type_local,surface_reelle_bati,nombre_pieces_principales,code_nature_culture,nature_culture,code_nature_culture_speciale,nature_culture_speciale,surface_terrain,longitude,latitude
2019-1071981,2019-04-18,000001,Vente,220836,5147,,LE CHAIX,B015,73220,73049,Bonvillaret,73,,,730490000B1425,,,,,,,,,,,,,0,1,Maison,80,4,S,sols,,,55,6.298037,45.555995
2019-1071981,2019-04-18,000001,Vente,220836,,,LE CHAIX,B015,73220,73049,Bonvillaret,73,,,730490000B1426,,,,,,,,,,,,,0,,,,,S,sols,,,43,6.297979,45.555985
2019-1071981,2019-04-18,000001,Vente,220836,,,LE CHAIX,B015,73220,73049,Bonvillaret,73,,,730490000B1427,,,,,,,,,,,,,0,,,,,S,sols,,,42,6.297915,45.555978
2019-1071981,2019-04-18,000001,Vente,220836,,,LE CHAIX,B015,73220,73049,Bonvillaret,73,,,730490000B1428,,,,,,,,,,,,,0,,,,,P,prés,,,84,6.297869,45.555979
2019-1071981,2019-04-18,000001,Vente,220836,,,LE CHAIX,B015,73220,73049,Bonvillaret,73,,,730490000B1429,,,,,,,,,,,,,0,,,,,P,prés,,,211,6.297711,45.555971
2019-1071981,2019-04-18,000001,Vente,220836,,,LE CHAIX,B015,73220,73049,Bonvillaret,73,,,730490000B1432,,,,,,,,,,,,,0,,,,,VI,vignes,,,422,6.297818,45.556118
2019-1071981,2019-04-18,000001,Vente,220836,,,LE CHAIX,B015,73220,73049,Bonvillaret,73,,,730490000B1442,,,,,,,,,,,,,0,,,,,T,terres,,,630,6.298365,45.556595
2019-1071981,2019-04-18,000001,Vente,220836,,,SUR LE CHAIX,B016,73220,73049,Bonvillaret,73,,,730490000B1717,,,,,,,,,,,,,0,,,,,T,terres,,,455,6.29829,45.556815
2019-1071981,2019-04-18,000001,Vente,220836,,,SUR LE CHAIX,B016,73220,73049,Bonvillaret,73,,,730490000B1718,,,,,,,,,,,,,0,,,,,T,terres,,,175,6.298322,45.556308
2019-1071981,2019-04-18,000001,Vente,220836,,,SUR LE CHAIX,B016,73220,73049,Bonvillaret,73,,,730490000B1719,,,,,,,,,,,,,0,,,,,T,terres,,,430,6.298077,45.55609
2019-1073348,2019-06-18,000001,Vente,28000,,,LES SENELLES,B126,73220,73049,Bonvillaret,73,,,730490000B0842,,,,,,,,,,,,,0,,,,,P,prés,,,1080,6.297382,45.558495
2019-1073348,2019-06-18,000001,Vente,28000,,,LES SENELLES,B126,73220,73049,Bonvillaret,73,,,730490000B0843,,,,,,,,,,,,,0,,,,,VI,vignes,,,3400,6.297923,45.558568
2019-1073348,2019-06-18,000001,Vente,28000,,,LES SENELLES,B126,73220,73049,Bonvillaret,73,,,730490000B0844,,,,,,,,,,,,,0,,,,,P,prés,,,3260,6.298445,45.558481
2019-1073348,2019-06-18,000001,Vente,28000,,,LES SENELLES,B126,73220,73049,Bonvillaret,73,,,730490000B0845,,,,,,,,,,,,,0,,,,,BT,taillis simples,,,381,6.298668,45.558338
2019-1073348,2019-06-18,000001,Vente,28000,,,LES SENELLES,B126,73220,73049,Bonvillaret,73,,,730490000B0846,,,,,,,,,,,,,0,,,,,VI,vignes,,,585,6.299051,45.558651
2019-1073348,2019-06-18,000001,Vente,28000,5119,,LES SENELLES,B126,73220,73049,Bonvillaret,73,,,730490000B0847,,,,,,,,,,,,,0,1,Maison,30,2,S,sols,,,138,6.299088,45.558725
2019-1073348,2019-06-18,000001,Vente,28000,,,LES SENELLES,B126,73220,73049,Bonvillaret,73,,,730490000B0848,,,,,,,,,,,,,0,,,,,P,prés,,,970,6.29767,45.558919
2019-1073348,2019-06-18,000001,Vente,28000,,,LES SENELLES,B126,73220,73049,Bonvillaret,73,,,730490000B0849,,,,,,,,,,,,,0,,,,,VI,vignes,,,630,6.297277,45.558896
2019-1081000,2019-10-11,000001,Vente,1,,,LE CUCHET,B050,73220,73049,Bonvillaret,73,,,730490000B2058,,,,,,,,,,,,,0,,,,,L,landes,FRICH,Friche,129,6.288375,45.562234
2019-1081522,2019-10-29,000001,Vente,3000,,,LA BUIRDE,B011,73220,73049,Bonvillaret,73,,,730490000A0171,,,,,,,,,,,,,0,,,,,BT,taillis simples,,,2180,6.314503,45.570148
2019-1081522,2019-10-29,000001,Vente,3000,,,DEVIN,B055,73220,73049,Bonvillaret,73,,,730490000A0259,,,,,,,,,,,,,0,,,,,BT,taillis simples,,,436,6.310516,45.569464
2019-1081522,2019-10-29,000001,Vente,3000,,,DEVIN,B055,73220,73049,Bonvillaret,73,,,730490000A0260,,,,,,,,,,,,,0,,,,,BT,taillis simples,,,347,6.310492,45.569604
2019-1081522,2019-10-29,000001,Vente,3000,,,LE MINACHON,B077,73220,73049,Bonvillaret,73,,,730490000A0405,,,,,,,,,,,,,0,,,,,S,sols,,,35,6.308815,45.568552
2019-1081522,2019-10-29,000001,Vente,3000,,,LE MINACHON,B077,73220,73049,Bonvillaret,73,,,730490000A0410,,,,,,,,,,,,,0,,,,,PA,pâtures,PATUR,Pâture plantée,18,6.308543,45.568582
2019-1081522,2019-10-29,000001,Vente,3000,,,LE MINACHON,B077,73220,73049,Bonvillaret,73,,,730490000A0411,,,,,,,,,,,,,0,,,,,PA,pâtures,PATUR,Pâture plantée,1485,6.308043,45.568642
2019-1081522,2019-10-29,000001,Vente,3000,,,LE MINACHON,B077,73220,73049,Bonvillaret,73,,,730490000A0422,,,,,,,,,,,,,0,,,,,PA,pâtures,PATUR,Pâture plantée,1490,6.308868,45.56944
2019-1081522,2019-10-29,000001,Vente,3000,,,LE MINACHON,B077,73220,73049,Bonvillaret,73,,,730490000A0423,,,,,,,,,,,,,0,,,,,PA,pâtures,PATUR,Pâture plantée,725,6.309725,45.569511
2019-1081522,2019-10-29,000001,Vente,3000,,,CREUX DU LOUP,B046,73220,73049,Bonvillaret,73,,,730490000A0479,,,,,,,,,,,,,0,,,,,BR,futaies résineuses,,,1315,6.308018,45.572726
2019-1081522,2019-10-29,000001,Vente,3000,,,LA GRANDE MOUILLE,B069,73220,73049,Bonvillaret,73,,,730490000A1076,,,,,,,,,,,,,0,,,,,BT,taillis simples,,,625,6.291482,45.569846
2019-1081522,2019-10-29,000001,Vente,3000,,,LE CUCHET,B050,73220,73049,Bonvillaret,73,,,730490000B1200,,,,,,,,,,,,,0,,,,,P,prés,,,200,6.286914,45.562143
2019-1081522,2019-10-29,000001,Vente,3000,,,PIED DES PRES,B096,73220,73049,Bonvillaret,73,,,730490000C0569,,,,,,,,,,,,,0,,,,,PA,pâtures,PATUR,Pâture plantée,435,6.307096,45.558517
2019-1081522,2019-10-29,000001,Vente,3000,,,PIED DES PRES,B096,73220,73049,Bonvillaret,73,,,730490000C0570,,,,,,,,,,,,,0,,,,,BT,taillis simples,,,675,6.306812,45.558419
2019-1084789,2019-12-12,000001,Vente,1461,,,LA GRANDE MOUILLE,B069,73220,73049,Bonvillaret,73,,,730490000A1093,,,,,,,,,,,,,0,,,,,BT,taillis simples,,,486,6.290614,45.569543
