id_mutation,date_mutation,numero_disposition,nature_mutation,valeur_fonciere,adresse_numero,adresse_suffixe,adresse_nom_voie,adresse_code_voie,code_postal,code_commune,nom_commune,code_departement,ancien_code_commune,ancien_nom_commune,id_parcelle,ancien_id_parcelle,numero_volume,lot1_numero,lot1_surface_carrez,lot2_numero,lot2_surface_carrez,lot3_numero,lot3_surface_carrez,lot4_numero,lot4_surface_carrez,lot5_numero,lot5_surface_carrez,nombre_lots,code_type_local,type_local,surface_reelle_bati,nombre_pieces_principales,code_nature_culture,nature_culture,code_nature_culture_speciale,nature_culture_speciale,surface_terrain,longitude,latitude
2019-1069099,2019-01-17,000001,Vente,1255,,,PRE DU RIFF,B036,73800,73141,Laissaud,73,,,731410000B0171,,,,,,,,,,,,,0,,,,,T,terres,,,1255,6.040165,45.453594
2019-1069100,2019-01-16,000001,Vente,2710,,,PRE POURRI,B045,73800,73141,Laissaud,73,,,73141000ZI0053,,,,,,,,,,,,,0,,,,,T,terres,,,2710,6.023388,45.451955
2019-1069250,2019-01-28,000001,Vente,4000,,,PRE JEAN VIEUX,B039,73800,73141,Laissaud,73,,,731410000B0044,,,,,,,,,,,,,0,,,,,BP,peupleraies,,,5400,6.03195,45.447645
2019-1069663,2019-02-12,000001,Vente,215000,130,,RUE DE SAINTE ANNE,0750,73800,73141,Laissaud,73,,,731410000B1946,,,,,,,,,,,,,0,2,Appartement,96,4,S,sols,,,416,6.047173,45.447742
2019-1069663,2019-02-12,000001,Vente,215000,130,,RUE DE SAINTE ANNE,0750,73800,73141,Laissaud,73,,,731410000B1946,,,,,,,,,,,,,0,3,Dépendance,,0,S,sols,,,416,6.047173,45.447742
2019-1069663,2019-02-12,000001,Vente,215000,130,,RUE DE SAINTE ANNE,0750,73800,73141,Laissaud,73,,,731410000B1947,,,1,26,2,3.16,,,,,,,2,3,Dépendance,,0,,,,,,6.047271,45.447756
2019-1069663,2019-02-12,000001,Vente,215000,,,MERLIN,B026,73800,73141,Laissaud,73,,,731410000B1951,,,,,,,,,,,,,0,,,,,S,sols,,,103,6.047265,45.447842
2019-1069663,2019-02-12,000001,Vente,215000,,,MERLIN,B026,73800,73141,Laissaud,73,,,731410000B1952,,,,,,,,,,,,,0,,,,,S,sols,,,2,6.047331,45.447942
2019-1069668,2019-01-23,000002,Vente,20000,,,LAISSAUD,B016,73800,73141,Laissaud,73,,,731410000B2262,,,,,,,,,,,,,0,,,,,S,sols,,,182,6.037971,45.447369
2019-1070641,2019-03-20,000001,Vente,252970,230,,RUE DU BOURG,0156,73800,73141,Laissaud,73,,,731410000B0599,,,,,,,,,,,,,0,1,Maison,88,4,S,sols,,,268,6.039418,45.446228
2019-1071280,2019-03-19,000001,Vente,95000,,,LA MALADIERE,B020,73800,73141,Laissaud,73,,,731410000B0420,,,,,,,,,,,,,0,,,,,P,prés,,,1876,6.037486,45.449676
2019-1071280,2019-03-19,000001,Vente,95000,,,LA MALADIERE,B020,73800,73141,Laissaud,73,,,731410000B0420,,,,,,,,,,,,,0,,,,,S,sols,,,34,6.037486,45.449676
2019-1071280,2019-03-19,000001,Vente,95000,,,LA MALADIERE,B020,73800,73141,Laissaud,73,,,731410000B0421,,,,,,,,,,,,,0,,,,,P,prés,,,25,6.037311,45.449589
2019-1071280,2019-03-19,000001,Vente,95000,,,LA MALADIERE,B020,73800,73141,Laissaud,73,,,731410000B0423,,,,,,,,,,,,,0,,,,,P,prés,,,1663,6.036981,45.449996
2019-1071280,2019-03-19,000001,Vente,95000,,,LA MALADIERE,B020,73800,73141,Laissaud,73,,,731410000B0423,,,,,,,,,,,,,0,,,,,S,sols,,,17,6.036981,45.449996
2019-1071280,2019-03-19,000001,Vente,95000,5011,,LA MALADIERE,B020,73800,73141,Laissaud,73,,,731410000B0424,,,,,,,,,,,,,0,1,Maison,26,2,S,sols,,,250,6.037338,45.449766
2019-1071280,2019-03-19,000001,Vente,95000,,,LA MALADIERE,B020,73800,73141,Laissaud,73,,,731410000B0429,,,,,,,,,,,,,0,,,,,VE,vergers,,,4720,6.037502,45.450113
2019-1071280,2019-03-19,000001,Vente,95000,,,LA MALADIERE,B020,73800,73141,Laissaud,73,,,731410000B1423,,,,,,,,,,,,,0,,,,,P,prés,,,10,6.037258,45.449471
2019-1071295,2019-03-26,000001,Vente,861.05,,,PRE BILLARD,B032,73800,73141,Laissaud,73,,,731410000B1781,,,,,,,,,,,,,0,,,,,T,terres,,,1013,6.044075,45.453487
2019-1072191,2019-05-16,000001,Vente,287980,418,,RD 923,0680,73800,73141,Laissaud,73,,,731410000B0498,,,,,,,,,,,,,0,1,Maison,120,4,S,sols,,,551,6.037261,45.446806
2019-1072532,2019-05-24,000001,Vente,889200,,,LES MARAIS,B022,73800,73141,Laissaud,73,,,731410000B1493,,,,,,,,,,,,,0,,,,,AB,terrains a bâtir,,,100,6.033232,45.444667
2019-1072532,2019-05-24,000001,Vente,889200,,,LES MARAIS,B022,73800,73141,Laissaud,73,,,731410000B1520,,,,,,,,,,,,,0,,,,,AB,terrains a bâtir,,,1018,6.033278,45.444406
2019-1072532,2019-05-24,000001,Vente,889200,,,LES MARAIS,B022,73800,73141,Laissaud,73,,,731410000B1522,,,,,,,,,,,,,0,,,,,AB,terrains a bâtir,,,785,6.033672,45.444172
2019-1072532,2019-05-24,000001,Vente,889200,,,LES MARAIS,B022,73800,73141,Laissaud,73,,,731410000B1571,,,,,,,,,,,,,0,,,,,S,sols,,,964,6.034091,45.44456
2019-1072532,2019-05-24,000001,Vente,889200,,,LES MARAIS,B022,73800,73141,Laissaud,73,,,731410000B1572,,,,,,,,,,,,,0,,,,,S,sols,,,771,6.033936,45.444373
2019-1072532,2019-05-24,000001,Vente,889200,,,LES MARAIS,B022,73800,73141,Laissaud,73,,,731410000B1575,,,,,,,,,,,,,0,,,,,S,sols,,,977,6.033798,45.444911
2019-1072532,2019-05-24,000001,Vente,889200,,,LES MARAIS,B022,73800,73141,Laissaud,73,,,731410000B1576,,,,,,,,,,,,,0,,,,,S,sols,,,885,6.03351,45.444788
2019-1072532,2019-05-24,000001,Vente,889200,,,LES MARAIS,B022,73800,73141,Laissaud,73,,,731410000B1577,,,,,,,,,,,,,0,,,,,S,sols,,,833,6.033409,45.444576
2019-1072532,2019-05-24,000001,Vente,889200,,,LES MARAIS,B022,73800,73141,Laissaud,73,,,731410000B1582,,,,,,,,,,,,,0,,,,,S,sols,,,84,6.033555,45.445052
2019-1072532,2019-05-24,000001,Vente,889200,,,LES MARAIS,B022,73800,73141,Laissaud,73,,,731410000B1583,,,,,,,,,,,,,0,,,,,S,sols,,,85,6.033412,45.444875
2019-1072532,2019-05-24,000001,Vente,889200,,,LES MARAIS,B022,73800,73141,Laissaud,73,,,731410000B1584,,,,,,,,,,,,,0,,,,,S,sols,,,89,6.03324,45.444666
2019-1072532,2019-05-24,000001,Vente,889200,,,LES MARAIS,B022,73800,73141,Laissaud,73,,,731410000B1585,,,,,,,,,,,,,0,,,,,S,sols,,,534,6.033802,45.444286
2019-1072532,2019-05-24,000001,Vente,889200,,,LES MARAIS,B022,73800,73141,Laissaud,73,,,731410000B1586,,,,,,,,,,,,,0,,,,,S,sols,,,120,6.033444,45.444439
2019-1072532,2019-05-24,000001,Vente,889200,120,,RUE DU GRESIVAUDAN,0460,73800,73141,Laissaud,73,,,731410000B1826,,,,,,,,,,,,,0,4,Local industriel. commercial ou assimilé,3752,0,S,sols,,,5299,6.032922,45.444699
2019-1072532,2019-05-24,000001,Vente,889200,,,LES MARAIS,B022,73800,73141,Laissaud,73,,,731410000B1884,,,,,,,,,,,,,0,,,,,S,sols,,,3211,6.032598,45.444977
2019-1072593,2019-05-27,000001,Vente,2900,,,PRE TARDY,B048,73800,73141,Laissaud,73,,,73141000ZA0018,,,,,,,,,,,,,0,,,,,T,terres,,,3130,6.030336,45.462763
2019-1073415,2019-06-21,000002,Vente,800,,,MERLIN,B026,73800,73141,Laissaud,73,,,731410000B2155,,,,,,,,,,,,,0,,,,,P,prés,,,184,6.048073,45.447674
2019-1074728,2019-07-30,000001,Vente,271550,807,,RD 923,0680,73800,73141,Laissaud,73,,,731410000B2132,,,,,,,,,,,,,0,1,Maison,145,5,S,sols,,,1036,6.039948,45.449806
2019-1075545,2019-08-08,000002,Vente,7372,,,PRE LACLOITRE,B043,73800,73141,Laissaud,73,,,731410000B2289,,,,,,,,,,,,,0,,,,,T,terres,,,65,6.039361,45.452249
2019-1075545,2019-08-08,000002,Vente,7372,,,PRE LACLOITRE,B043,73800,73141,Laissaud,73,,,731410000B2291,,,,,,,,,,,,,0,,,,,T,terres,,,138,6.039204,45.452193
2019-1075844,2019-08-30,000001,Vente,47500,738,,RTE DE LA PLAINE,0650,73800,73141,Laissaud,73,,,73141000ZB0025,,,,,,,,,,,,,0,4,Local industriel. commercial ou assimilé,60,0,S,sols,,,1348,,
2019-1075844,2019-08-30,000001,Vente,47500,738,,RTE DE LA PLAINE,0650,73800,73141,Laissaud,73,,,73141000ZB0025,,,,,,,,,,,,,0,1,Maison,274,6,S,sols,,,1348,,
2019-1075844,2019-08-30,000001,Vente,47500,,,MAS DE COISE,B024,73800,73141,Laissaud,73,,,73141000ZB0027,,,,,,,,,,,,,0,,,,,P,prés,,,124,,
2019-1075844,2019-08-30,000001,Vente,47500,,,MAS DE COISE,B024,73800,73141,Laissaud,73,,,73141000ZB0027,,,,,,,,,,,,,0,,,,,T,terres,,,124,,
2019-1075844,2019-08-30,000001,Vente,47500,,,MAS DE COISE,B024,73800,73141,Laissaud,73,,,73141000ZB0028,,,,,,,,,,,,,0,,,,,VE,vergers,,,1000,6.036007,45.456406
2019-1080352,2019-10-11,000001,Vente,211250,530,,RD 923,0680,73800,73141,Laissaud,73,,,731410000B2101,,,,,,,,,,,,,0,1,Maison,98,4,S,sols,,,206,6.038241,45.447635
2019-1080352,2019-10-11,000001,Vente,211250,,,LAISSAUD,B016,73800,73141,Laissaud,73,,,731410000B2105,,,,,,,,,,,,,0,,,,,S,sols,,,282,6.038184,45.447823
2019-1082230,2019-10-30,000001,Vente,327690,39,,CHE DU COLOMBIER,0290,73800,73141,Laissaud,73,,,731410000B0468,,,,,,,,,,,,,0,1,Maison,76,4,S,sols,,,500,6.041217,45.4481
2019-1082230,2019-10-30,000001,Vente,327690,39,,CHE DU COLOMBIER,0290,73800,73141,Laissaud,73,,,731410000B0468,,,,,,,,,,,,,0,1,Maison,76,4,P,prés,,,2185,6.041217,45.4481
2019-1082384,2019-11-13,000001,Vente,560,,,POUCET,B031,73800,73141,Laissaud,73,,,731410000B1022,,,,,,,,,,,,,0,,,,,BT,taillis simples,,,845,6.050212,45.448581
2019-1082467,2019-11-25,000001,Vente,11000,,,LAISSAUD,B016,73800,73141,Laissaud,73,,,731410000B0567,,,,,,,,,,,,,0,,,,,S,sols,,,27,6.04012,45.445446
2019-1082467,2019-11-25,000001,Vente,11000,,,CHATAIGNERAIE,B006,73800,73141,Laissaud,73,,,731410000B0720,,,,,,,,,,,,,0,,,,,BT,taillis simples,,,445,,
2019-1082467,2019-11-25,000001,Vente,11000,,,CHATAIGNERAIE,B006,73800,73141,Laissaud,73,,,731410000B0721,,,,,,,,,,,,,0,,,,,BT,taillis simples,,,690,,
2019-1082960,2019-11-12,000001,Vente,10000,,,MAS DES ESSARTS,B025,73800,73141,Laissaud,73,,,731410000A0296,,,,,,,,,,,,,0,,,,,VE,vergers,,,1445,6.017351,45.458105
2019-1083702,2019-11-08,000001,Vente,79000,,,LA MALADIERE,B020,73800,73141,Laissaud,73,,,731410000B0412,,,,,,,,,,,,,0,,,,,S,sols,,,70,6.037474,45.448276
2019-1083702,2019-11-08,000001,Vente,79000,,,LA MALADIERE,B020,73800,73141,Laissaud,73,,,731410000B0412,,,,,,,,,,,,,0,,,,,VE,vergers,,,930,6.037474,45.448276
2019-1083759,2019-12-10,000001,Vente,130000,468,,RD 923,0680,73800,73141,Laissaud,73,,,731410000B0503,,,,,,,,,,,,,0,1,Maison,66,3,S,sols,,,437,6.037717,45.447208
2019-1085227,2019-07-16,000001,Vente,25000,,,LA MALADIERE,B020,73800,73141,Laissaud,73,,,731410000B0422,,,,,,,,,,,,,0,,,,,P,prés,,,1839,6.036907,45.449764
2019-1085227,2019-07-16,000001,Vente,25000,,,CHATAIGNERAIE,B006,73800,73141,Laissaud,73,,,731410000B0796,,,,,,,,,,,,,0,,,,,BT,taillis simples,,,690,6.042073,45.446448
2019-1085227,2019-07-16,000001,Vente,25000,,,CHATAIGNERAIE,B006,73800,73141,Laissaud,73,,,731410000B0816,,,,,,,,,,,,,0,,,,,BT,taillis simples,,,2035,6.04372,45.447357
2019-1085227,2019-07-16,000001,Vente,25000,,,CHATAIGNERAIE,B006,73800,73141,Laissaud,73,,,731410000B0817,,,,,,,,,,,,,0,,,,,BT,taillis simples,,,900,6.043468,45.447012
2019-1085227,2019-07-16,000001,Vente,25000,,,CHATAIGNERAIE,B006,73800,73141,Laissaud,73,,,731410000B0820,,,,,,,,,,,,,0,,,,,BT,taillis simples,,,885,6.043943,45.44693
2019-1085227,2019-07-16,000001,Vente,25000,,,CHATAIGNERAIE,B006,73800,73141,Laissaud,73,,,731410000B0822,,,,,,,,,,,,,0,,,,,BT,taillis simples,,,75,6.044133,45.447455
2019-1085227,2019-07-16,000001,Vente,25000,,,CHATAIGNERAIE,B006,73800,73141,Laissaud,73,,,731410000B0826,,,,,,,,,,,,,0,,,,,BT,taillis simples,,,615,6.044699,45.447586
2019-1085227,2019-07-16,000001,Vente,25000,,,CHATAIGNERAIE,B006,73800,73141,Laissaud,73,,,731410000B0827,,,,,,,,,,,,,0,,,,,BT,taillis simples,,,615,6.044452,45.447675
2019-1085227,2019-07-16,000001,Vente,25000,,,CHATAIGNERAIE,B006,73800,73141,Laissaud,73,,,731410000B1610,,,,,,,,,,,,,0,,,,,BT,taillis simples,,,1187,6.042359,45.446184
2019-1085227,2019-07-16,000001,Vente,25000,,,LE CLOS,B007,73800,73141,Laissaud,73,,,731410000B2124,,,,,,,,,,,,,0,,,,,P,prés,,,1078,6.044139,45.448458
2019-1085227,2019-07-16,000001,Vente,25000,,,LE CLOS,B007,73800,73141,Laissaud,73,,,731410000B2272,,,,,,,,,,,,,0,,,,,P,prés,,,38801,6.043871,45.448297
2019-1085227,2019-07-16,000001,Vente,25000,,,LE CLOS,B007,73800,73141,Laissaud,73,,,731410000B2272,,,,,,,,,,,,,0,,,,,BT,taillis simples,,,12019,6.043871,45.448297
