id_mutation,date_mutation,numero_disposition,nature_mutation,valeur_fonciere,adresse_numero,adresse_suffixe,adresse_nom_voie,adresse_code_voie,code_postal,code_commune,nom_commune,code_departement,ancien_code_commune,ancien_nom_commune,id_parcelle,ancien_id_parcelle,numero_volume,lot1_numero,lot1_surface_carrez,lot2_numero,lot2_surface_carrez,lot3_numero,lot3_surface_carrez,lot4_numero,lot4_surface_carrez,lot5_numero,lot5_surface_carrez,nombre_lots,code_type_local,type_local,surface_reelle_bati,nombre_pieces_principales,code_nature_culture,nature_culture,code_nature_culture_speciale,nature_culture_speciale,surface_terrain,longitude,latitude
2019-1069119,2019-01-09,000001,Vente,81000,3,,PL RENE CASSIN,0383,73800,73171,Montmélian,73,,,73171000AM0024,,,3,43.12,,,,,,,,,1,2,Appartement,43,2,,,,,,6.050522,45.500112
2019-1069175,2019-01-16,000001,Vente,140000,5538,,RUE JEAN MOULIN,0260,73800,73171,Montmélian,73,,,73171000AE0016,,,6,98.68,65,,,,,,,,2,2,Appartement,99,5,,,,,,6.063193,45.503154
2019-1069175,2019-01-16,000001,Vente,140000,5538,,RUE JEAN MOULIN,0260,73800,73171,Montmélian,73,,,73171000AE0016,,,118,,,,,,,,,,1,3,Dépendance,,0,,,,,,6.063193,45.503154
2019-1069260,2019-01-08,000001,Vente,15000,,,MOLLARD PORTIER,B027,73800,73171,Montmélian,73,,,731710000A0368,,,,,,,,,,,,,0,,,,,T,terres,,,239,6.058263,45.508262
2019-1069260,2019-01-08,000001,Vente,15000,,,MOLLARD PORTIER,B027,73800,73171,Montmélian,73,,,731710000A0369,,,,,,,,,,,,,0,,,,,T,terres,,,770,6.05822,45.508452
2019-1069260,2019-01-08,000001,Vente,15000,,,MOLLARD PORTIER,B027,73800,73171,Montmélian,73,,,731710000A0370,,,,,,,,,,,,,0,,,,,T,terres,,,3020,6.058511,45.508623
2019-1069260,2019-01-08,000001,Vente,15000,,,MOLLARD PORTIER,B027,73800,73171,Montmélian,73,,,731710000A0371,,,,,,,,,,,,,0,,,,,T,terres,,,275,6.05885,45.508633
2019-1069260,2019-01-08,000001,Vente,15000,,,MOLLARD PORTIER,B027,73800,73171,Montmélian,73,,,731710000A0372,,,,,,,,,,,,,0,,,,,T,terres,,,575,6.058929,45.508708
2019-1069260,2019-01-08,000001,Vente,15000,,,MOLLARD PORTIER,B027,73800,73171,Montmélian,73,,,731710000A0373,,,,,,,,,,,,,0,,,,,P,prés,,,580,6.058786,45.508866
2019-1069260,2019-01-08,000001,Vente,15000,,,MOLLARD PORTIER,B027,73800,73171,Montmélian,73,,,731710000A0374,,,,,,,,,,,,,0,,,,,VI,vignes,,,275,6.058649,45.509041
2019-1069260,2019-01-08,000001,Vente,15000,,,MOLLARD PORTIER,B027,73800,73171,Montmélian,73,,,731710000A0377,,,,,,,,,,,,,0,,,,,VI,vignes,,,425,6.058952,45.509079
2019-1069260,2019-01-08,000001,Vente,15000,,,MOLLARD PORTIER,B027,73800,73171,Montmélian,73,,,731710000A0378,,,,,,,,,,,,,0,,,,,BT,taillis simples,,,255,6.059268,45.50884
2019-1069260,2019-01-08,000001,Vente,15000,,,GARGAZ,B017,73800,73171,Montmélian,73,,,731710000A0756,,,,,,,,,,,,,0,,,,,L,landes,FRICH,Friche,2600,6.070244,45.516123
2019-1069260,2019-01-08,000001,Vente,15000,,,LA MONTAGNE,B028,73800,73171,Montmélian,73,,,731710000A0843,,,,,,,,,,,,,0,,,,,BT,taillis simples,,,8940,6.068195,45.522753
2019-1069275,2019-01-07,000001,Vente,216800,26,,RUE DU PARAPET,0330,73800,73171,Montmélian,73,,,73171000AI0212,,,22,101.33,,,,,,,,,1,2,Appartement,101,3,,,,,,6.058398,45.501527
2019-1069275,2019-01-07,000001,Vente,216800,26,,RUE DU PARAPET,0330,73800,73171,Montmélian,73,,,73171000AI0214,,,,,,,,,,,,,0,,,,,S,sols,,,61,6.05825,45.501399
2019-1069275,2019-01-07,000001,Vente,216800,26,,RUE DU PARAPET,0330,73800,73171,Montmélian,73,,,73171000AI0215,,,,,,,,,,,,,0,,,,,J,jardins,,,476,6.058051,45.501369
2019-1069285,2019-01-14,000001,Vente,94750,2,,AV DE LA GARE,0180,73800,73171,Montmélian,73,,,73171000AN0027,,,116,,,,,,,,,,1,2,Appartement,60,2,,,,,,6.046422,45.501601
2019-1069369,2019-01-30,000001,Vente,55000,20,,RUE DOCTEUR VEYRAT,0100,73800,73171,Montmélian,73,,,73171000AK0034,,,,,,,,,,,,,0,2,Appartement,45,4,S,sols,,,128,6.059453,45.500479
2019-1069369,2019-01-30,000001,Vente,55000,20,,RUE DOCTEUR VEYRAT,0100,73800,73171,Montmélian,73,,,73171000AK0034,,,,,,,,,,,,,0,2,Appartement,90,6,S,sols,,,128,6.059453,45.500479
2019-1070169,2019-02-22,000001,Vente,228250,35,,RUE EUGENE BERTHIER,0130,73800,73171,Montmélian,73,,,73171000AK0097,,,16,,17,,,,,,,,2,2,Appartement,129,3,,,,,,6.058956,45.499184
2019-1070169,2019-02-22,000001,Vente,228250,,,RUE EUGENE BERTHIER,0130,73800,73171,Montmélian,73,,,73171000AK0098,,,,,,,,,,,,,0,,,,,S,sols,,,76,6.058839,45.499234
2019-1070169,2019-02-22,000001,Vente,228250,,,RUE EUGENE BERTHIER,0130,73800,73171,Montmélian,73,,,73171000AK0099,,,,,,,,,,,,,0,,,,,S,sols,,,134,6.058965,45.499314
2019-1070632,2019-03-08,000001,Vente,144000,32,,RUE DOCTEUR VEYRAT,0100,73800,73171,Montmélian,73,,,73171000AK0050,,,,,,,,,,,,,0,1,Maison,140,3,S,sols,,,470,6.059446,45.499979
2019-1070676,2019-03-05,000001,Vente,160555,756,,AV DU GRESIVAUDAN,0210,73800,73171,Montmélian,73,,,73171000AN0113,,,12,,,,,,,,,,1,3,Dépendance,,0,,,,,,6.045643,45.49837
2019-1070676,2019-03-05,000001,Vente,160555,756,,AV DU GRESIVAUDAN,0210,73800,73171,Montmélian,73,,,73171000AN0113,,,26,67.6,,,,,,,,,1,2,Appartement,67,3,,,,,,6.045643,45.49837
2019-1070782,2019-03-15,000002,Vente,92000,,,QUAI DE L ISERE,0220,73800,73171,Montmélian,73,,,73171000AH0119,,,,,,,,,,,,,0,,,,,S,sols,,,189,6.060187,45.499393
2019-1070812,2019-03-29,000001,Vente,191000,756,,AV DU GRESIVAUDAN,0210,73800,73171,Montmélian,73,,,73171000AN0113,,,38,78.51,,,,,,,,,1,2,Appartement,78,4,,,,,,6.045643,45.49837
2019-1070812,2019-03-29,000001,Vente,191000,756,,AV DU GRESIVAUDAN,0210,73800,73171,Montmélian,73,,,73171000AN0113,,,3,,,,,,,,,,1,3,Dépendance,,0,,,,,,6.045643,45.49837
2019-1071366,2019-04-16,000001,Vente,10000,225,,AV DE LA GARE,0180,73800,73171,Montmélian,73,,,73171000AA0112,,,201,,,,,,,,,,1,3,Dépendance,,0,,,,,,,
2019-1071711,2019-04-29,000001,Vente,128720,20,,AV GIRARD MADOUX,0200,73800,73171,Montmélian,73,,,73171000AM0161,,,2,81.77,,,,,,,,,1,2,Appartement,76,4,,,,,,6.054851,45.498971
2019-1071860,2019-04-23,000001,Vente,138500,814,,AV DU GRESIVAUDAN,0210,73800,73171,Montmélian,73,,,73171000AN0112,,,21,,,,,,,,,,1,3,Dépendance,,0,,,,,,6.044958,45.498447
2019-1071860,2019-04-23,000001,Vente,138500,814,,AV DU GRESIVAUDAN,0210,73800,73171,Montmélian,73,,,73171000AN0112,,,35,,,,,,,,,,1,2,Appartement,53,2,,,,,,6.044958,45.498447
2019-1071940,2019-05-07,000001,Vente,231000,1,,AV DU FORT,0160,73800,73171,Montmélian,73,,,73171000AM0045,,,,,,,,,,,,,0,,,,,S,sols,,,61,6.053167,45.500197
2019-1071940,2019-05-07,000001,Vente,231000,1,,AV DU FORT,0160,73800,73171,Montmélian,73,,,73171000AM0046,,,,,,,,,,,,,0,1,Maison,81,4,S,sols,,,392,6.05301,45.500145
2019-1071940,2019-05-07,000001,Vente,231000,1,,AV DU FORT,0160,73800,73171,Montmélian,73,,,73171000AM0047,,,,,,,,,,,,,0,,,,,S,sols,,,30,6.052865,45.500198
2019-1071940,2019-05-07,000001,Vente,231000,1,,AV DU FORT,0160,73800,73171,Montmélian,73,,,73171000AM0048,,,,,,,,,,,,,0,,,,,S,sols,,,5,6.052869,45.500222
2019-1072045,2019-05-10,000001,Vente,157500,814,,AV DU GRESIVAUDAN,0210,73800,73171,Montmélian,73,,,73171000AN0112,,,23,,,,,,,,,,1,2,Appartement,65,3,,,,,,6.044958,45.498447
2019-1072045,2019-05-10,000001,Vente,157500,814,,AV DU GRESIVAUDAN,0210,73800,73171,Montmélian,73,,,73171000AN0112,,,12,,,,,,,,,,1,3,Dépendance,,0,,,,,,6.044958,45.498447
2019-1072366,2019-05-09,000001,Vente,79000,5447,,RES LE CYCLAMEN,A060,73800,73171,Montmélian,73,,,73171000AC0045,,,7H,,,,,,,,,,1,3,Dépendance,,0,,,,,,6.060797,45.502765
2019-1072366,2019-05-09,000001,Vente,79000,5443,,RES LE CYCLAMEN,A060,73800,73171,Montmélian,73,,,73171000AC0045,,,17G,,9G,,,,,,,,2,2,Appartement,49,2,,,,,,6.060797,45.502765
2019-1072708,2019-06-05,000001,Vente,139800,290,,AV DE SAVOIE,0410,73800,73171,Montmélian,73,,,73171000AM0219,,,58,57.12,,,,,,,,,1,2,Appartement,55,2,,,,,,6.051888,45.501616
2019-1072791,2019-05-28,000001,Vente,90090,5475,,RES LES LILAS,A100,73800,73171,Montmélian,73,,,73171000AE0015,,,18,,70,65,,,,,,,2,2,Appartement,64,3,,,,,,6.063661,45.503507
2019-1072858,2019-05-31,000001,Vente,121500,756,,AV DU GRESIVAUDAN,0210,73800,73171,Montmélian,73,,,73171000AN0113,,,40,53.63,,,,,,,,,1,2,Appartement,53,2,,,,,,6.045643,45.49837
2019-1072888,2019-06-07,000001,Vente,173305,5268,,MTE DU FORT,0170,73800,73171,Montmélian,73,,,73171000AI0125,,,,,,,,,,,,,0,1,Maison,90,5,S,sols,,,68,6.05824,45.50164
2019-1073669,2019-06-28,000001,Vente,210000,756,,AV DU GRESIVAUDAN,0210,73800,73171,Montmélian,73,,,73171000AN0113,,,43,,,,,,,,,,1,2,Appartement,78,4,,,,,,6.045643,45.49837
2019-1073669,2019-06-28,000001,Vente,210000,756,,AV DU GRESIVAUDAN,0210,73800,73171,Montmélian,73,,,73171000AN0113,,,20,,,,,,,,,,1,3,Dépendance,,0,,,,,,6.045643,45.49837
2019-1073691,2019-06-24,000001,Vente,235840,7,,RUE FRANCOIS DUMAS,0150,73800,73171,Montmélian,73,,,73171000AI0006,,,,,,,,,,,,,0,1,Maison,127,4,S,sols,,,119,6.056893,45.50231
2019-1074175,2019-07-04,000001,Vente,117000,5464,,PL ALBERT SERRAZ,0030,73800,73171,Montmélian,73,,,73171000AC0071,,,27,76.5,98,,,,,,,,2,2,Appartement,76,4,,,,,,6.054477,45.502515
2019-1074194,2019-07-08,000001,Vente,189000,5691,F,AV DE SAVOIE,0410,73800,73171,Montmélian,73,,,73171000AM0219,,,85,,,,,,,,,,1,3,Dépendance,,0,,,,,,6.051888,45.501616
2019-1074194,2019-07-08,000001,Vente,189000,256,,AV DE SAVOIE,0410,73800,73171,Montmélian,73,,,73171000AM0219,,,111,,117,,,,,,,,2,2,Appartement,79,4,,,,,,6.051888,45.501616
2019-1074243,2019-07-12,000001,Vente,499200,38,,CHEM DE LA THUILE,0420,73800,73171,Montmélian,73,,,73171000AB0158,,,,,,,,,,,,,0,1,Maison,188,6,S,sols,,,944,6.057819,45.507651
2019-1074479,2019-07-05,000001,Vente,365680,58,,CHEM DE LA THUILE,0420,73800,73171,Montmélian,73,,,73171000AB0156,,,,,,,,,,,,,0,1,Maison,141,6,S,sols,,,500,6.058044,45.507789
2019-1074479,2019-07-05,000001,Vente,365680,58,,CHEM DE LA THUILE,0420,73800,73171,Montmélian,73,,,73171000AB0156,,,,,,,,,,,,,0,1,Maison,141,6,T,terres,,,468,6.058044,45.507789
2019-1074736,2019-07-19,000001,Vente,123000,5462,,AV DU PDT EDOUARD HERRIOT,0350,73800,73171,Montmélian,73,,,73171000AE0007,,,17B,,7B,,,,,,,,2,2,Appartement,75,4,,,,,,6.062948,45.502153
2019-1074736,2019-07-19,000001,Vente,123000,5462,,AV DU PDT EDOUARD HERRIOT,0350,73800,73171,Montmélian,73,,,73171000AE0007,,,9C,,,,,,,,,,1,3,Dépendance,,0,,,,,,6.062948,45.502153
2019-1074825,2019-07-15,000001,Vente,192570,814,,AV DU GRESIVAUDAN,0210,73800,73171,Montmélian,73,,,73171000AN0112,,,3,,,,,,,,,,1,3,Dépendance,,0,,,,,,6.044958,45.498447
2019-1074825,2019-07-15,000001,Vente,192570,814,,AV DU GRESIVAUDAN,0210,73800,73171,Montmélian,73,,,73171000AN0112,,,47,77,,,,,,,,,1,2,Appartement,86,4,,,,,,6.044958,45.498447
2019-1075008,2019-07-26,000001,Vente,144910,5464,,PL ALBERT SERRAZ,0030,73800,73171,Montmélian,73,,,73171000AC0071,,,127,,135,75,,,,,,,2,2,Appartement,74,4,,,,,,6.054477,45.502515
2019-1075129,2019-08-02,000003,Vente terrain à bâtir,12950,,,SOUS LE BOURG,B040,73800,73171,Montmélian,73,,,73171000AC0098,,,,,,,,,,,,,0,,,,,S,sols,,,75,6.061358,45.500974
2019-1075129,2019-08-02,000003,Vente terrain à bâtir,12950,,,SOUS LE BOURG,B040,73800,73171,Montmélian,73,,,73171000AC0100,,,,,,,,,,,,,0,,,,,S,sols,,,605,6.061808,45.501234
2019-1075184,2019-08-05,000001,Vente,395000,,,LA GENERALE,B018,73800,73171,Montmélian,73,,,73171000AB0163,,,,,,,,,,,,,0,,,,,AG,terrains d'agrément,,,288,6.054524,45.50716
2019-1075184,2019-08-05,000001,Vente,395000,1217,,AV DES CALLOUDES,0048,73800,73171,Montmélian,73,,,73171000AB0165,,,,,,,,,,,,,0,1,Maison,181,5,S,sols,,,826,6.054756,45.507244
2019-1075222,2019-08-01,000001,Vente,108000,5462,,AV DU PDT EDOUARD HERRIOT,0350,73800,73171,Montmélian,73,,,73171000AE0007,,,16C,,4C,,,,,,,,2,2,Appartement,69,3,,,,,,6.062948,45.502153
2019-1075460,2019-08-27,000001,Vente,1129457.6,5050,,AV PDT PIERRE DE LA GONTRIE,0360,73800,73171,Montmélian,73,,,73171000AN0028,,,,,,,,,,,,,0,4,Local industriel. commercial ou assimilé,1875,0,S,sols,,,13685,,
2019-1075460,2019-08-27,000001,Vente,1129457.6,5050,,AV PDT PIERRE DE LA GONTRIE,0360,73800,73171,Montmélian,73,,,73171000AN0028,,,,,,,,,,,,,0,4,Local industriel. commercial ou assimilé,,,S,sols,,,13685,,
2019-1075460,2019-08-27,000001,Vente,1129457.6,5050,,AV DE LA GARE,0180,73800,73171,Montmélian,73,,,73171000AN0030,,,,,,,,,,,,,0,2,Appartement,85,8,S,sols,,,783,,
2019-1075460,2019-08-27,000001,Vente,1129457.6,5050,,AV DE LA GARE,0180,73800,73171,Montmélian,73,,,73171000AN0030,,,,,,,,,,,,,0,3,Dépendance,,0,S,sols,,,783,,
2019-1075460,2019-08-27,000001,Vente,1129457.6,5050,,AV DE LA GARE,0180,73800,73171,Montmélian,73,,,73171000AN0030,,,,,,,,,,,,,0,2,Appartement,85,6,S,sols,,,783,,
2019-1075460,2019-08-27,000001,Vente,1129457.6,5050,,AV DE LA GARE,0180,73800,73171,Montmélian,73,,,73171000AN0030,,,,,,,,,,,,,0,2,Appartement,85,5,S,sols,,,783,,
2019-1075460,2019-08-27,000001,Vente,1129457.6,,,MARTHOT,B026,73800,73171,Montmélian,73,,,73171000AN0032,,,,,,,,,,,,,0,,,,,AB,terrains a bâtir,,,608,,
2019-1075464,2019-08-27,000001,Vente,654555,,,MARTHOT,B026,73800,73171,Montmélian,73,,,73171000AN0026,,,,,,,,,,,,,0,,,,,S,sols,,,1000,,
2019-1075464,2019-08-27,000001,Vente,654555,,,MARTHOT,B026,73800,73171,Montmélian,73,,,73171000AN0026,,,,,,,,,,,,,0,,,,,AB,terrains a bâtir,,,460,,
2019-1075464,2019-08-27,000001,Vente,654555,5052,,AV PDT PIERRE DE LA GONTRIE,0360,73800,73171,Montmélian,73,,,73171000AN0029,,,,,,,,,,,,,0,3,Dépendance,,0,S,sols,,,52,,
2019-1075464,2019-08-27,000001,Vente,654555,5052,,AV PDT PIERRE DE LA GONTRIE,0360,73800,73171,Montmélian,73,,,73171000AN0029,,,,,,,,,,,,,0,3,Dépendance,,0,AB,terrains a bâtir,,,7225,,
2019-1075483,2019-08-23,000002,Vente,241220,88,,RUE JEAN MOULIN,0260,73800,73171,Montmélian,73,,,73171000AC0102,,,,,,,,,,,,,0,1,Maison,79,5,S,sols,,,379,6.062037,45.504393
2019-1075576,2019-08-29,000001,Vente,243919.44,5668,F,CHE DE LA CARONNIERE,0049,73800,73171,Montmélian,73,,,73171000AD0173,,,,,,,,,,,,,0,4,Local industriel. commercial ou assimilé,308,0,S,sols,,,1734,6.06863,45.503667
2019-1075672,2019-08-30,000001,Vente,97820,6,,RUE DOCTEUR VEYRAT,0100,73800,73171,Montmélian,73,,,73171000AK0010,,,3,,,,,,,,,,1,3,Dépendance,,0,,,,,,6.059242,45.500787
2019-1075672,2019-08-30,000001,Vente,97820,6,,RUE DOCTEUR VEYRAT,0100,73800,73171,Montmélian,73,,,73171000AK0010,,,4,62.33,5,,9,,,,,,3,2,Appartement,50,5,,,,,,6.059242,45.500787
2019-1075729,2019-08-20,000001,Vente,560000,,,SOUS LE FORT,B041,73800,73171,Montmélian,73,,,73171000AA0107,,,,,,,,,,,,,0,,,,,S,sols,,,7,6.048728,45.501852
2019-1075729,2019-08-20,000001,Vente,560000,9,,AV DE LA GARE,0180,73800,73171,Montmélian,73,,,73171000AA0108,,,,,,,,,,,,,0,,,,,S,sols,,,326,6.048794,45.501747
2019-1075729,2019-08-20,000001,Vente,560000,9,,AV DE LA GARE,0180,73800,73171,Montmélian,73,,,73171000AA0109,,,,,,,,,,,,,0,4,Local industriel. commercial ou assimilé,330,0,S,sols,,,399,6.048651,45.501775
2019-1075729,2019-08-20,000001,Vente,560000,,,SOUS LE FORT,B041,73800,73171,Montmélian,73,,,73171000AA0183,,,,,,,,,,,,,0,,,,,P,prés,,,338,6.048774,45.502037
2019-1075729,2019-08-20,000001,Vente,560000,9,,AV DE LA GARE,0180,73800,73171,Montmélian,73,,,73171000AA0185,,,,,,,,,,,,,0,,,,,S,sols,,,352,6.048652,45.502002
2019-1075813,2019-08-30,000001,Vente,269000,813,,AV DES CALLOUDES,0048,73800,73171,Montmélian,73,,,73171000AB0021,,,,,,,,,,,,,0,1,Maison,81,4,S,sols,,,263,6.055731,45.506802
2019-1075843,2019-09-09,000001,Vente,195175,225,,AV DE LA GARE,0180,73800,73171,Montmélian,73,,,73171000AA0112,,,106,,127,,,,,,,,2,2,Appartement,79,4,,,,,,,
2019-1075843,2019-09-09,000001,Vente,195175,225,,AV DE LA GARE,0180,73800,73171,Montmélian,73,,,73171000AA0112,,,117,,,,,,,,,,1,3,Dépendance,,0,,,,,,,
2019-1075895,2019-08-30,000001,Vente,220000,27,,RUE FRANCOIS DUMAS,0150,73800,73171,Montmélian,73,,,73171000AI0036,,,14,,,,,,,,,,1,3,Dépendance,,0,,,,,,6.058141,45.502134
2019-1075895,2019-08-30,000001,Vente,220000,27,,RUE FRANCOIS DUMAS,0150,73800,73171,Montmélian,73,,,73171000AI0036,,,15,,,,,,,,,,1,2,Appartement,140,4,,,,,,6.058141,45.502134
2019-1076055,2019-09-13,000001,Vente,168600,5464,,PL ALBERT SERRAZ,0030,73800,73171,Montmélian,73,,,73171000AC0071,,,103,,22,88.62,,,,,,,2,2,Appartement,90,4,,,,,,6.054477,45.502515
2019-1080288,2019-09-30,000001,Vente,133440,5443,,RES LE CYCLAMEN,A060,73800,73171,Montmélian,73,,,73171000AC0045,,,11D,66.15,3D,,,,,,,,2,2,Appartement,66,4,,,,,,6.060797,45.502765
2019-1080297,2019-10-03,000001,Vente,143210,5062,,RES BELLEDONNE,A040,73800,73171,Montmélian,73,,,73171000AM0011,,,63,65.11,64,,,,,,,,2,2,Appartement,67,4,,,,,,6.049973,45.500579
2019-1080328,2019-09-30,000001,Vente,55000,6,,RUE DOCTEUR VEYRAT,0100,73800,73171,Montmélian,73,,,73171000AK0010,,,2,63.1,,,,,,,,,1,4,Local industriel. commercial ou assimilé,64,0,,,,,,6.059242,45.500787
2019-1080328,2019-09-30,000001,Vente,55000,6,,RUE DOCTEUR VEYRAT,0100,73800,73171,Montmélian,73,,,73171000AK0010,,,3,,,,,,,,,,1,3,Dépendance,,0,,,,,,6.059242,45.500787
2019-1080578,2019-09-26,000001,Vente,95000,5475,,RES LES LILAS,A100,73800,73171,Montmélian,73,,,73171000AE0015,,,15,,45,,,,,,,,2,2,Appartement,64,3,,,,,,6.063661,45.503507
2019-1080663,2019-10-16,000001,Vente,29100,5465,,PL ALBERT SERRAZ,0030,73800,73171,Montmélian,73,,,73171000AC0070,,,2,,,,,,,,,,1,3,Dépendance,,0,,,,,,6.054136,45.502975
2019-1080704,2019-10-17,000001,Vente,14000,5462,,AV DU PDT EDOUARD HERRIOT,0350,73800,73171,Montmélian,73,,,73171000AE0007,,,11B,,,,,,,,,,1,3,Dépendance,,0,,,,,,6.062948,45.502153
2019-1080821,2019-10-17,000001,Vente,130500,5462,,AV DU PDT EDOUARD HERRIOT,0350,73800,73171,Montmélian,73,,,73171000AE0007,,,18B,64.84,3B,,,,,,,,2,2,Appartement,65,3,,,,,,6.062948,45.502153
2019-1081171,2019-10-16,000001,Vente,1000,,,MALATRET,B024,73800,73171,Montmélian,73,,,731710000A0585,,,,,,,,,,,,,0,,,,,VI,vignes,VDQS,Vins délimités de qualité supérieure,575,6.065241,45.510087
2019-1082433,2019-10-17,000001,Vente,165000,1,,AV DE LA GARE,0180,73800,73171,Montmélian,73,,,73171000AA0173,,,,,,,,,,,,,0,1,Maison,59,4,S,sols,,,822,,
2019-1082725,2019-11-29,000001,Vente,115350,5462,,AV DU PDT EDOUARD HERRIOT,0350,73800,73171,Montmélian,73,,,73171000AE0007,,,18C,69.27,6C,,,,,,,,2,2,Appartement,69,3,,,,,,6.062948,45.502153
2019-1082800,2019-11-27,000001,Vente,570000,95,,AV DU GRESIVAUDAN,0210,73800,73171,Montmélian,73,,,73171000AL0044,,,12,,13,,,,,,,,2,4,Local industriel. commercial ou assimilé,427,0,,,,,,6.053883,45.496389
2019-1082819,2019-12-03,000001,Vente,210000,5033,,AV DE LA GARE,0180,73800,73171,Montmélian,73,,,73171000AA0079,,,,,,,,,,,,,0,1,Maison,100,7,S,sols,,,827,6.051841,45.502397
2019-1082870,2019-11-27,000001,Vente,660000,5000,,CREVE COEUR,B010,73800,73171,Montmélian,73,,,73171000AL0044,,,14,255.68,4,,43,,44,,45,,14,4,Local industriel. commercial ou assimilé,300,0,,,,,,6.053883,45.496389
2019-1083772,2019-12-18,000001,Vente,480000,429,,AV DU GRESIVAUDAN,0210,73800,73171,Montmélian,73,,,73171000AO0025,,,1,,,,,,,,,,1,4,Local industriel. commercial ou assimilé,84,0,,,,,,6.049046,45.496631
2019-1083772,2019-12-18,000001,Vente,480000,429,,AV DU GRESIVAUDAN,0210,73800,73171,Montmélian,73,,,73171000AO0025,,,1,,,,,,,,,,1,4,Local industriel. commercial ou assimilé,389,0,,,,,,6.049046,45.496631
2019-1083797,2019-12-19,000001,Vente,85800,,,SOUS LE FORT,B041,73800,73171,Montmélian,73,,,73171000AA0190,,,,,,,,,,,,,0,,,,,S,sols,,,600,6.048266,45.5023
2019-1084076,2019-12-23,000001,Vente,330000,5319,,RUE DES REMPARTS,0380,73800,73171,Montmélian,73,,,73171000AI0093,,,,,,,,,,,,,0,2,Appartement,70,2,S,sols,,,260,6.05962,45.501657
2019-1084076,2019-12-23,000001,Vente,330000,5319,,RUE DES REMPARTS,0380,73800,73171,Montmélian,73,,,73171000AI0093,,,,,,,,,,,,,0,2,Appartement,147,5,S,sols,,,260,6.05962,45.501657
2019-1084076,2019-12-23,000001,Vente,330000,5319,,RUE DES REMPARTS,0380,73800,73171,Montmélian,73,,,73171000AI0093,,,,,,,,,,,,,0,3,Dépendance,,0,S,sols,,,260,6.05962,45.501657
2019-1084076,2019-12-23,000001,Vente,330000,5319,,RUE DES REMPARTS,0380,73800,73171,Montmélian,73,,,73171000AI0093,,,,,,,,,,,,,0,2,Appartement,59,2,S,sols,,,260,6.05962,45.501657
2019-1084076,2019-12-23,000001,Vente,330000,61,,RUE FRANCOIS DUMAS,0150,73800,73171,Montmélian,73,,,73171000AI0159,,,,,,,,,,,,,0,3,Dépendance,,0,S,sols,,,30,6.059364,45.501605
2019-1084415,2019-12-26,000001,Vente,164000,814,,AV DU GRESIVAUDAN,0210,73800,73171,Montmélian,73,,,73171000AN0112,,,29,,,,,,,,,,1,2,Appartement,67,3,,,,,,6.044958,45.498447
2019-1084415,2019-12-26,000001,Vente,164000,814,,AV DU GRESIVAUDAN,0210,73800,73171,Montmélian,73,,,73171000AN0112,,,17,,,,,,,,,,1,3,Dépendance,,0,,,,,,6.044958,45.498447
2019-1084430,2019-12-27,000001,Vente,205000,5418,,RUE JEAN MOULIN,0260,73800,73171,Montmélian,73,,,73171000AC0024,,,,,,,,,,,,,0,1,Maison,101,6,S,sols,,,1035,6.061906,45.50458
2019-1084430,2019-12-27,000001,Vente,205000,,,RUE JEAN MOULIN,0260,73800,73171,Montmélian,73,,,73171000AC0101,,,,,,,,,,,,,0,,,,,S,sols,,,86,6.06206,45.504731
