id_mutation,date_mutation,numero_disposition,nature_mutation,valeur_fonciere,adresse_numero,adresse_suffixe,adresse_nom_voie,adresse_code_voie,code_postal,code_commune,nom_commune,code_departement,ancien_code_commune,ancien_nom_commune,id_parcelle,ancien_id_parcelle,numero_volume,lot1_numero,lot1_surface_carrez,lot2_numero,lot2_surface_carrez,lot3_numero,lot3_surface_carrez,lot4_numero,lot4_surface_carrez,lot5_numero,lot5_surface_carrez,nombre_lots,code_type_local,type_local,surface_reelle_bati,nombre_pieces_principales,code_nature_culture,nature_culture,code_nature_culture_speciale,nature_culture_speciale,surface_terrain,longitude,latitude
2019-1074631,2019-06-18,000001,Vente,112,,,AUX ZACS,B069,73200,73292,Thénésol,73,,,732920000A0728,,,,,,,,,,,,,0,,,,,P,prés,,,56,6.380383,45.719515
2019-1074638,2019-06-18,000001,Vente,190,,,LA REVILLIERE,B057,73200,73292,Thénésol,73,,,732920000B1162,,,,,,,,,,,,,0,,,,,P,prés,,,95,6.405336,45.719057
2019-1081534,2019-10-24,000001,Echange,172,,,LA LEVA,B037,73200,73292,Thénésol,73,,,732920000B0707,,,,,,,,,,,,,0,,,,,P,prés,,,345,6.384597,45.716422
2019-1081535,2019-10-24,000002,Echange,187,,,LA LEVA,B037,73200,73292,Thénésol,73,,,732920000B0708,,,,,,,,,,,,,0,,,,,P,prés,,,375,6.38455,45.716727
2019-1081722,2019-10-31,000001,Vente,3000,,,LES GRANDS PRES,B035,73200,73292,Thénésol,73,,,732920000C0807,,,,,,,,,,,,,0,,,,,BM,futaies mixtes,,,420,6.389488,45.709251
2019-1081722,2019-10-31,000001,Vente,3000,,,LES GRANDS PRES,B035,73200,73292,Thénésol,73,,,732920000C0808,,,,,,,,,,,,,0,,,,,P,prés,,,7250,6.390202,45.709259
2019-1081771,2019-11-05,000001,Vente,355000,5010,,CARNABE,B005,73200,73292,Thénésol,73,,,732920000A0502,,,,,,,,,,,,,0,1,Maison,143,5,S,sols,,,900,6.37977,45.721625
2019-1081771,2019-11-05,000001,Vente,355000,,,CARNABE,B005,73200,73292,Thénésol,73,,,732920000A0504,,,,,,,,,,,,,0,,,,,P,prés,,,2495,6.380346,45.721624
2019-1081771,2019-11-05,000001,Vente,355000,,,CARNABE,B005,73200,73292,Thénésol,73,,,732920000A0869,,,,,,,,,,,,,0,,,,,P,prés,,,150,6.379987,45.722123
2019-1081771,2019-11-05,000001,Vente,355000,,,CARNABE,B005,73200,73292,Thénésol,73,,,732920000A0870,,,,,,,,,,,,,0,,,,,P,prés,,,415,6.379995,45.721904
2019-1082360,2019-11-21,000002,Vente,3500,,,LES PERRIERES,B043,73200,73292,Thénésol,73,,,732920000C1168,,,,,,,,,,,,,0,,,,,BM,futaies mixtes,,,1624,6.408196,45.718241
2019-1083182,2019-11-29,000001,Vente,252210,5037,,AUX CHESEAUX,B012,73200,73292,Thénésol,73,,,732920000B1418,,,2,152.8,,,,,,,,,1,2,Appartement,148,5,,,,,,6.391353,45.713652
2019-1083182,2019-11-29,000001,Vente,252210,,,AUX CHESEAUX,B012,73200,73292,Thénésol,73,,,732920000B1419,,,,,,,,,,,,,0,,,,,S,sols,,,430,6.391179,45.713716
2019-1083182,2019-11-29,000001,Vente,252210,,,AUX CHESEAUX,B012,73200,73292,Thénésol,73,,,732920000B1422,,,,,,,,,,,,,0,,,,,L,landes,FRICH,Friche,13,6.391102,45.713634
