id_mutation,date_mutation,numero_disposition,nature_mutation,valeur_fonciere,adresse_numero,adresse_suffixe,adresse_nom_voie,adresse_code_voie,code_postal,code_commune,nom_commune,code_departement,ancien_code_commune,ancien_nom_commune,id_parcelle,ancien_id_parcelle,numero_volume,lot1_numero,lot1_surface_carrez,lot2_numero,lot2_surface_carrez,lot3_numero,lot3_surface_carrez,lot4_numero,lot4_surface_carrez,lot5_numero,lot5_surface_carrez,nombre_lots,code_type_local,type_local,surface_reelle_bati,nombre_pieces_principales,code_nature_culture,nature_culture,code_nature_culture_speciale,nature_culture_speciale,surface_terrain,longitude,latitude
2019-1086070,2019-01-28,000001,Vente,800000,,,MARCORAN HAUT,B034,74290,74036,Bluffy,74,,,740360000A1633,,,,,,,,,,,,,0,,,,,BS,taillis sous futaie,,,67,6.213924,45.856819
2019-1086963,2019-02-21,000001,Vente,461895,44,,ALL LE CHENE,0030,74290,74036,Bluffy,74,,,740360000A2096,,,8,,,,,,,,,,1,3,Dépendance,,0,,,,,,6.217288,45.868355
2019-1086963,2019-02-21,000001,Vente,461895,44,,ALL LE CHENE,0030,74290,74036,Bluffy,74,,,740360000A2096,,,26,,35,,,,,,,,2,2,Appartement,84,3,,,,,,6.217288,45.868355
2019-1087881,2019-03-27,000001,Vente,200000,,,PRES DE LA CROIX,B045,74290,74036,Bluffy,74,,,740360000A2152,,,,,,,,,,,,,0,,,,,AB,terrains a bâtir,,,1725,6.211457,45.869953
2019-1087881,2019-03-27,000001,Vente,200000,,,PRES DE LA CROIX,B045,74290,74036,Bluffy,74,,,740360000A2153,,,,,,,,,,,,,0,,,,,S,sols,,,66,6.210836,45.870035
2019-1088316,2019-04-04,000001,Vente,370700,44,,ALL LE CHENE,0030,74290,74036,Bluffy,74,,,740360000A2096,,,4,,,,,,,,,,1,3,Dépendance,,0,,,,,,6.217288,45.868355
2019-1088316,2019-04-04,000001,Vente,370700,44,,ALL LE CHENE,0030,74290,74036,Bluffy,74,,,740360000A2096,,,16,,33,,,,,,,,2,2,Appartement,85,3,,,,,,6.217288,45.868355
2019-1089834,2019-05-13,000001,Vente,507400,,,MARCORAN HAUT,B034,74290,74036,Bluffy,74,,,740360000A0548,,,,,,,,,,,,,0,,,,,P,prés,,,213,,
2019-1089834,2019-05-13,000001,Vente,507400,,,MARCORAN HAUT,B034,74290,74036,Bluffy,74,,,740360000A1665,,,,,,,,,,,,,0,,,,,P,prés,,,2110,,
2019-1089834,2019-05-13,000001,Vente,507400,,,MARCORAN HAUT,B034,74290,74036,Bluffy,74,,,740360000A1678,,,,,,,,,,,,,0,,,,,P,prés,,,86,,
2019-1089917,2019-05-13,000001,Vente,374850,,,MARCORAN HAUT,B034,74290,74036,Bluffy,74,,,740360000A0543,,,,,,,,,,,,,0,,,,,P,prés,,,1210,6.214302,45.85765
2019-1089917,2019-05-13,000001,Vente,374850,,,MARCORAN HAUT,B034,74290,74036,Bluffy,74,,,740360000A1680,,,,,,,,,,,,,0,,,,,P,prés,,,2870,,
2019-1091112,2019-06-07,000001,Vente,1654900,658,,RTE DES DENTS DE LANFON,0060,74290,74036,Bluffy,74,,,740360000A0205,,,,,,,,,,,,,0,2,Appartement,66,3,S,sols,,,1860,6.217577,45.870174
2019-1091112,2019-06-07,000001,Vente,1654900,658,,RTE DES DENTS DE LANFON,0060,74290,74036,Bluffy,74,,,740360000A0205,,,,,,,,,,,,,0,1,Maison,260,9,S,sols,,,1860,6.217577,45.870174
2019-1091112,2019-06-07,000001,Vente,1654900,658,,RTE DES DENTS DE LANFON,0060,74290,74036,Bluffy,74,,,740360000A0205,,,,,,,,,,,,,0,3,Dépendance,,0,S,sols,,,1860,6.217577,45.870174
2019-1091112,2019-06-07,000001,Vente,1654900,,,SOUS LE PLATON,B054,74290,74036,Bluffy,74,,,740360000A1488,,,,,,,,,,,,,0,,,,,AB,terrains a bâtir,,,100,6.217968,45.87006
2019-1091112,2019-06-07,000001,Vente,1654900,,,SOUS LE PLATON,B054,74290,74036,Bluffy,74,,,740360000A2012,,,,,,,,,,,,,0,,,,,P,prés,,,85,6.217815,45.870177
2019-1091477,2019-06-24,000001,Vente,505100,44,,ALL LE CHENE,0030,74290,74036,Bluffy,74,,,740360000A2096,,,23,,31,111.95,,,,,,,2,2,Appartement,114,4,,,,,,6.217288,45.868355
2019-1091477,2019-06-24,000001,Vente,505100,44,,ALL LE CHENE,0030,74290,74036,Bluffy,74,,,740360000A2096,,,11,,,,,,,,,,1,3,Dépendance,,0,,,,,,6.217288,45.868355
2019-1095147,2019-10-09,000001,Vente,767350,,,LES PRES MOLLARD,B047,74290,74036,Bluffy,74,,,740360000A1234,,,,,,,,,,,,,0,,,,,BS,taillis sous futaie,,,224,6.218237,45.865803
2019-1095147,2019-10-09,000001,Vente,767350,,,LES PRES MOLLARD,B047,74290,74036,Bluffy,74,,,740360000A1416,,,,,,,,,,,,,0,,,,,P,prés,,,3421,6.217744,45.865584
2019-1095147,2019-10-09,000001,Vente,767350,,,PRES RASSY,B048,74290,74036,Bluffy,74,,,740360000A1611,,,,,,,,,,,,,0,,,,,P,prés,,,133,6.217996,45.865358
2019-1095147,2019-10-09,000001,Vente,767350,,,LES PRES MOLLARD,B047,74290,74036,Bluffy,74,,,740360000A1892,,,,,,,,,,,,,0,,,,,P,prés,,,10,6.218109,45.86587
2019-1095147,2019-10-09,000001,Vente,767350,,,PRES RASSY,B048,74290,74036,Bluffy,74,,,740360000A2170,,,,,,,,,,,,,0,,,,,P,prés,,,181,6.218229,45.865372
2019-1095147,2019-10-09,000001,Vente,767350,,,PRES RASSY,B048,74290,74036,Bluffy,74,,,740360000A2172,,,,,,,,,,,,,0,,,,,P,prés,,,221,6.218326,45.865495
2019-1095147,2019-10-09,000001,Vente,767350,1050,,RTE DES DENTS DE LANFON,0060,74290,74036,Bluffy,74,,,740360000A2173,,,,,,,,,,,,,0,1,Maison,189,7,S,sols,,,685,6.218296,45.86573
2019-1095147,2019-10-09,000001,Vente,767350,,,LES PRES MOLLARD,B047,74290,74036,Bluffy,74,,,740360000A2177,,,,,,,,,,,,,0,,,,,P,prés,,,187,6.218224,45.865957
2019-1095691,2019-10-28,000001,Vente,207446.06,,,LES PERRIERES,B041,74290,74036,Bluffy,74,,,740360000A1105,,,,,,,,,,,,,0,,,,,T,terres,,,1138,6.218279,45.867517
2019-1098983,2019-05-02,000001,Vente,1007400,48,,CHE DES SAPINS,0170,74290,74036,Bluffy,74,,,740360000A1666,,,,,,,,,,,,,0,3,Dépendance,,0,P,prés,,,1391,6.214939,45.858423
2019-1098983,2019-05-02,000001,Vente,1007400,48,,CHE DES SAPINS,0170,74290,74036,Bluffy,74,,,740360000A1666,,,,,,,,,,,,,0,3,Dépendance,,0,S,sols,,,1084,6.214939,45.858423
2019-1098983,2019-05-02,000001,Vente,1007400,48,,CHE DES SAPINS,0170,74290,74036,Bluffy,74,,,740360000A1666,,,,,,,,,,,,,0,3,Dépendance,,0,S,sols,,,1084,6.214939,45.858423
2019-1098983,2019-05-02,000001,Vente,1007400,48,,CHE DES SAPINS,0170,74290,74036,Bluffy,74,,,740360000A1666,,,,,,,,,,,,,0,4,Local industriel. commercial ou assimilé,104,0,S,sols,,,1084,6.214939,45.858423
2019-1098983,2019-05-02,000001,Vente,1007400,48,,CHE DES SAPINS,0170,74290,74036,Bluffy,74,,,740360000A1666,,,,,,,,,,,,,0,1,Maison,156,7,P,prés,,,1391,6.214939,45.858423
2019-1098983,2019-05-02,000001,Vente,1007400,48,,CHE DES SAPINS,0170,74290,74036,Bluffy,74,,,740360000A1666,,,,,,,,,,,,,0,3,Dépendance,,0,P,prés,,,1391,6.214939,45.858423
2019-1098983,2019-05-02,000001,Vente,1007400,48,,CHE DES SAPINS,0170,74290,74036,Bluffy,74,,,740360000A1666,,,,,,,,,,,,,0,4,Local industriel. commercial ou assimilé,104,0,P,prés,,,1391,6.214939,45.858423
2019-1098983,2019-05-02,000001,Vente,1007400,48,,CHE DES SAPINS,0170,74290,74036,Bluffy,74,,,740360000A1666,,,,,,,,,,,,,0,1,Maison,156,7,S,sols,,,1084,6.214939,45.858423
