id_mutation,date_mutation,numero_disposition,nature_mutation,valeur_fonciere,adresse_numero,adresse_suffixe,adresse_nom_voie,adresse_code_voie,code_postal,code_commune,nom_commune,code_departement,ancien_code_commune,ancien_nom_commune,id_parcelle,ancien_id_parcelle,numero_volume,lot1_numero,lot1_surface_carrez,lot2_numero,lot2_surface_carrez,lot3_numero,lot3_surface_carrez,lot4_numero,lot4_surface_carrez,lot5_numero,lot5_surface_carrez,nombre_lots,code_type_local,type_local,surface_reelle_bati,nombre_pieces_principales,code_nature_culture,nature_culture,code_nature_culture_speciale,nature_culture_speciale,surface_terrain,longitude,latitude
2019-1085290,2019-01-10,000002,Vente,265600,18,,MTE DES CHOSEAUX,0070,74540,74138,Gruffy,74,,,741380000A2042,,,,,,,,,,,,,0,1,Maison,79,3,S,sols,,,311,6.055583,45.792941
2019-1085290,2019-01-10,000002,Vente,265600,,,LES CHOSEAUX,B052,74540,74138,Gruffy,74,,,741380000A2045,,,,,,,,,,,,,0,,,,,S,sols,,,19,6.055537,45.792851
2019-1085290,2019-01-10,000002,Vente,265600,,,LES CHOSEAUX,B052,74540,74138,Gruffy,74,,,741380000A2046,,,,,,,,,,,,,0,,,,,J,jardins,,,195,6.055381,45.792932
2019-1085850,2019-01-16,000001,Vente,183000,5511,,LES GRANGES,B150,74540,74138,Gruffy,74,,,741380000A0561,,,22,,48,52.89,,,,,,,2,2,Appartement,52,2,,,,,,6.053578,45.789152
2019-1086231,2019-02-18,000001,Vente,40000,,,CRET DU VERNET,B095,74540,74138,Gruffy,74,,,741380000F1030,,,,,,,,,,,,,0,,,,,T,terres,,,196,6.037781,45.778703
2019-1087016,2019-02-22,000002,Vente,330,,,CRET DE LA GALERE,B093,74540,74138,Gruffy,74,,,741380000F0926,,,,,,,,,,,,,0,,,,,S,sols,,,15,6.04663,45.790271
2019-1087016,2019-02-22,000003,Vente,330,,,CRET DE LA GALERE,B093,74540,74138,Gruffy,74,,,741380000F1033,,,,,,,,,,,,,0,,,,,S,sols,,,33,6.046487,45.79011
2019-1087020,2019-02-18,000001,Vente,395550,90,,IMP DE LA CRAIE,0090,74540,74138,Gruffy,74,,,741380000A1384,,,,,,,,,,,,,0,1,Maison,136,3,P,prés,,,1020,6.054938,45.791723
2019-1087020,2019-02-18,000001,Vente,395550,90,,IMP DE LA CRAIE,0090,74540,74138,Gruffy,74,,,741380000A1384,,,,,,,,,,,,,0,1,Maison,136,3,S,sols,,,1020,6.054938,45.791723
2019-1087020,2019-02-18,000001,Vente,395550,,,LA CRAIE,B089,74540,74138,Gruffy,74,,,741380000A1390,,,,,,,,,,,,,0,,,,,T,terres,,,436,6.055437,45.79088
2019-1087431,2019-03-22,000002,Vente,150000,,,LE MOLLARET NORD,B180,74540,74138,Gruffy,74,,,741380000E1146,,,,,,,,,,,,,0,,,,,T,terres,,,1187,6.052349,45.781668
2019-1087514,2019-03-20,000001,Vente,3135.5,,,PRE VANGY,B221,74540,74138,Gruffy,74,,,741380000B0176,,,,,,,,,,,,,0,,,,,BR,futaies résineuses,SAPIN,Sapins ou sapinière,2444,6.065318,45.789227
2019-1087514,2019-03-20,000001,Vente,3135.5,,,COMBE DES CHOSEAUX-OUEST,B067,74540,74138,Gruffy,74,,,741380000B0181,,,,,,,,,,,,,0,,,,,BR,futaies résineuses,SAPIN,Sapins ou sapinière,3827,6.064906,45.789413
2019-1088235,2019-03-29,000001,Vente,350450,87,,IMP DE LA CRAIE,0090,74540,74138,Gruffy,74,,,741380000A1385,,,,,,,,,,,,,0,1,Maison,98,5,J,jardins,,,702,6.054681,45.791027
2019-1088235,2019-03-29,000001,Vente,350450,87,,IMP DE LA CRAIE,0090,74540,74138,Gruffy,74,,,741380000A1385,,,,,,,,,,,,,0,1,Maison,98,5,S,sols,,,1000,6.054681,45.791027
2019-1088262,2019-03-26,000003,Vente,530000,,,LES FOURS,B128,74540,74138,Gruffy,74,,,741380000B0716,,,,,,,,,,,,,0,,,,,L,landes,,,891,6.090303,45.794163
2019-1088262,2019-03-26,000003,Vente,530000,,,LES FOURS,B128,74540,74138,Gruffy,74,,,741380000B0717,,,,,,,,,,,,,0,,,,,BT,taillis simples,,,814,6.089492,45.793852
2019-1088262,2019-03-26,000003,Vente,530000,,,LES FOURS,B128,74540,74138,Gruffy,74,,,741380000B0718,,,,,,,,,,,,,0,,,,,L,landes,,,1455,6.089122,45.793714
2019-1088262,2019-03-26,000003,Vente,530000,,,LE SEMNOZ,B251,74540,74138,Gruffy,74,,,741380000C0001,,,,,,,,,,,,,0,,,,,PA,pâtures,,,165000,6.093163,45.7911
2019-1088262,2019-03-26,000003,Vente,530000,,,LE SEMNOZ,B251,74540,74138,Gruffy,74,,,741380000C0001,,,,,,,,,,,,,0,,,,,S,sols,,,92,6.093163,45.7911
2019-1088262,2019-03-26,000003,Vente,530000,,,LE SEMNOZ,B251,74540,74138,Gruffy,74,,,741380000C0001,,,,,,,,,,,,,0,,,,,L,landes,,,269531,6.093163,45.7911
2019-1088262,2019-03-26,000003,Vente,530000,,,LE SEMNOZ,B251,74540,74138,Gruffy,74,,,741380000C0001,,,,,,,,,,,,,0,,,,,PA,pâtures,,,160000,6.093163,45.7911
2019-1088262,2019-03-26,000003,Vente,530000,,,LE SEMNOZ,B251,74540,74138,Gruffy,74,,,741380000C0002,,,,,,,,,,,,,0,,,,,S,sols,,,1701,6.098777,45.79022
2019-1088753,2019-04-17,000001,Vente,145000,,,LE VERNET,B268,74540,74138,Gruffy,74,,,741380000F0236,,,,,,,,,,,,,0,,,,,T,terres,,,541,6.03433,45.780698
2019-1088753,2019-04-17,000001,Vente,145000,791,,RTE DU VERNET,0520,74540,74138,Gruffy,74,,,741380000F0239,,,,,,,,,,,,,0,1,Maison,42,2,S,sols,,,528,6.034623,45.780745
2019-1089142,2019-05-06,000001,Vente,380000,,,LE CORBET,B078,74540,74138,Gruffy,74,,,741380000A1252,,,,,,,,,,,,,0,,,,,S,sols,,,10,6.055449,45.78733
2019-1089142,2019-05-06,000001,Vente,380000,106,,MTE DES ECOLES,0110,74540,74138,Gruffy,74,,,741380000A1958,,,,,,,,,,,,,0,1,Maison,108,4,S,sols,,,566,6.05536,45.787459
2019-1089439,2019-04-30,000001,Vente,3000,,,LA TAILLEE NORD,B257,74540,74138,Gruffy,74,,,741380000D0212,,,,,,,,,,,,,0,,,,,P,prés,,,2051,6.060279,45.778387
2019-1089439,2019-04-30,000001,Vente,3000,,,LES PARREUSES,B194,74540,74138,Gruffy,74,,,741380000D0355,,,,,,,,,,,,,0,,,,,T,terres,,,3128,6.059546,45.780897
2019-1089439,2019-04-30,000001,Vente,3000,,,LE CLUS OUEST,B058,74540,74138,Gruffy,74,,,741380000D0410,,,,,,,,,,,,,0,,,,,T,terres,,,868,6.059045,45.781748
2019-1090223,2019-05-20,000002,Vente,98814,,,CRET DU VERNET,B095,74540,74138,Gruffy,74,,,741380000F1035,,,,,,,,,,,,,0,,,,,T,terres,,,600,6.039063,45.77925
2019-1090340,2019-05-31,000001,Vente,100000,2522,,RTE DES BAUGES,0025,74540,74138,Gruffy,74,,,741380000A0539,,,7,,,,,,,,,,1,3,Dépendance,,0,,,,,,6.0543,45.788265
2019-1090340,2019-05-31,000001,Vente,100000,2544,,RTE DES BAUGES,0025,74540,74138,Gruffy,74,,,741380000A0539,,,13,,,,,,,,,,1,2,Appartement,38,1,,,,,,6.0543,45.788265
2019-1090340,2019-05-31,000001,Vente,100000,2540,,RTE DES BAUGES,0025,74540,74138,Gruffy,74,,,741380000A0539,,,14,,4,,,,,,,,2,2,Appartement,47,2,,,,,,6.0543,45.788265
2019-1090340,2019-05-31,000001,Vente,100000,2522,,RTE DES BAUGES,0025,74540,74138,Gruffy,74,,,741380000A0539,,,3,,,,,,,,,,1,3,Dépendance,,0,,,,,,6.0543,45.788265
2019-1090340,2019-05-31,000001,Vente,100000,2522,,RTE DES BAUGES,0025,74540,74138,Gruffy,74,,,741380000A0539,,,1,,2,,,,,,,,2,3,Dépendance,,0,,,,,,6.0543,45.788265
2019-1090340,2019-05-31,000001,Vente,100000,2522,,RTE DES BAUGES,0025,74540,74138,Gruffy,74,,,741380000A0539,,,10,,12,,5,,,,,,3,2,Appartement,135,5,,,,,,6.0543,45.788265
2019-1090507,2019-06-06,000001,Vente,216350,154,,RTE D'ALBY,0005,74540,74138,Gruffy,74,,,741380000A0544,,,5,,,,,,,,,,1,3,Dépendance,,0,,,,,,6.053351,45.788445
2019-1090507,2019-06-06,000001,Vente,216350,154,,RTE D'ALBY,0005,74540,74138,Gruffy,74,,,741380000A0544,,,22,,,,,,,,,,1,2,Appartement,60,3,,,,,,6.053351,45.788445
2019-1090787,2019-06-20,000001,Vente,1000,,,LES PRES D EN BAS,B224,74540,74138,Gruffy,74,,,741380000A0180,,,,,,,,,,,,,0,,,,,P,prés,,,554,6.052976,45.793989
2019-1090787,2019-06-20,000001,Vente,1000,,,LES PRES D EN BAS,B224,74540,74138,Gruffy,74,,,741380000A0181,,,,,,,,,,,,,0,,,,,P,prés,,,554,6.052991,45.794187
2019-1091840,2019-06-28,000001,Vente,361500,,,PARQUET NORD,B191,74540,74138,Gruffy,74,,,741380000A1425,,,,,,,,,,,,,0,,,,,L,landes,,,101,6.059515,45.78747
2019-1091840,2019-06-28,000001,Vente,361500,,,PARQUET NORD,B191,74540,74138,Gruffy,74,,,741380000A1427,,,,,,,,,,,,,0,,,,,L,landes,,,58,6.059763,45.787852
2019-1091840,2019-06-28,000001,Vente,361500,,,PARQUET NORD,B191,74540,74138,Gruffy,74,,,741380000A1807,,,,,,,,,,,,,0,,,,,P,prés,,,60,6.059414,45.787586
2019-1091840,2019-06-28,000001,Vente,361500,,,PARQUET NORD,B191,74540,74138,Gruffy,74,,,741380000A1811,,,,,,,,,,,,,0,,,,,L,landes,,,15,6.05938,45.787486
2019-1091840,2019-06-28,000001,Vente,361500,,,PARQUET NORD,B191,74540,74138,Gruffy,74,,,741380000A1964,,,,,,,,,,,,,0,,,,,S,sols,,,28,6.059449,45.787726
2019-1091840,2019-06-28,000001,Vente,361500,136,,MTE DU NOIRET,0300,74540,74138,Gruffy,74,,,741380000A1965,,,,,,,,,,,,,0,1,Maison,77,3,S,sols,,,918,6.059579,45.787726
2019-1092766,2019-08-07,000002,Vente,220000,3511,,RTE DES BAUGES,0025,74540,74138,Gruffy,74,,,741380000D0863,,,,,,,,,,,,,0,2,Appartement,86,3,S,sols,,,1258,6.05315,45.779646
2019-1092766,2019-08-07,000002,Vente,220000,3511,,RTE DES BAUGES,0025,74540,74138,Gruffy,74,,,741380000D0863,,,,,,,,,,,,,0,2,Appartement,94,3,S,sols,,,1258,6.05315,45.779646
2019-1092766,2019-08-07,000002,Vente,220000,3511,,RTE DES BAUGES,0025,74540,74138,Gruffy,74,,,741380000D0863,,,,,,,,,,,,,0,3,Dépendance,,0,S,sols,,,1258,6.05315,45.779646
2019-1092766,2019-08-07,000002,Vente,220000,,,LES CHARPINES NORD,B042,74540,74138,Gruffy,74,,,741380000D0864,,,,,,,,,,,,,0,,,,,S,sols,,,1,6.053177,45.779497
2019-1092766,2019-08-07,000002,Vente,220000,,,LES CHARPINES NORD,B042,74540,74138,Gruffy,74,,,741380000D0865,,,,,,,,,,,,,0,,,,,T,terres,,,43,6.05317,45.77988
2019-1093723,2019-08-28,000001,Vente,137190,,,LE MOLLARD,B179,74540,74138,Gruffy,74,,,741380000E1121,,,,,,,,,,,,,0,,,,,T,terres,,,405,6.052159,45.781762
2019-1093723,2019-08-28,000001,Vente,137190,,,LE MOLLARD,B179,74540,74138,Gruffy,74,,,741380000E1124,,,,,,,,,,,,,0,,,,,T,terres,,,402,6.052034,45.781861
2019-1093782,2019-08-30,000001,Vente,211475,5510,,GRUFFY,B153,74540,74138,Gruffy,74,,,741380000A1987,,,,,,,,,,,,,0,1,Maison,75,2,S,sols,,,198,6.056603,45.788577
2019-1093782,2019-08-30,000001,Vente,211475,,,LE NOIRET,B190,74540,74138,Gruffy,74,,,741380000A1993,,,,,,,,,,,,,0,,,,,T,terres,,,50,6.056758,45.788542
2019-1093782,2019-08-30,000001,Vente,211475,,,LE NOIRET,B190,74540,74138,Gruffy,74,,,741380000A1995,,,,,,,,,,,,,0,,,,,S,sols,,,46,6.056841,45.788548
2019-1093978,2019-08-23,000001,Vente,425000,227,,MTE DU NOIRET,0300,74540,74138,Gruffy,74,,,741380000A1632,,,,,,,,,,,,,0,1,Maison,127,5,J,jardins,,,1368,,
2019-1093978,2019-08-23,000001,Vente,425000,227,,MTE DU NOIRET,0300,74540,74138,Gruffy,74,,,741380000A1632,,,,,,,,,,,,,0,1,Maison,127,5,S,sols,,,1000,,
2019-1094122,2019-09-03,000002,Vente,28160,,,LA CRAIE,B089,74540,74138,Gruffy,74,,,741380000A2063,,,,,,,,,,,,,0,,,,,T,terres,,,176,6.05547,45.791789
2019-1094708,2019-09-13,000001,Vente,260000,,,PARQUET SUD,B192,74540,74138,Gruffy,74,,,741380000A0747,,,,,,,,,,,,,0,,,,,L,landes,,,148,6.057754,45.786146
2019-1094708,2019-09-13,000001,Vente,260000,297,,CHE DU CHATEAU,0060,74540,74138,Gruffy,74,,,741380000A0748,,,,,,,,,,,,,0,1,Maison,90,3,S,sols,,,242,6.057868,45.786148
2019-1094708,2019-09-13,000001,Vente,260000,,,PARQUET SUD,B192,74540,74138,Gruffy,74,,,741380000A0750,,,,,,,,,,,,,0,,,,,S,sols,,,41,6.057943,45.78614
2019-1094708,2019-09-13,000001,Vente,260000,,,PARQUET SUD,B192,74540,74138,Gruffy,74,,,741380000A0750,,,,,,,,,,,,,0,,,,,S,sols,,,41,6.057943,45.78614
2019-1094749,2019-09-16,000001,Vente,319000,100,,IMP DE LA CHENA,0064,74540,74138,Gruffy,74,,,741380000A1876,,,,,,,,,,,,,0,1,Maison,126,6,S,sols,,,635,6.056557,45.786538
2019-1094749,2019-09-16,000001,Vente,319000,,,LE CORBET,B078,74540,74138,Gruffy,74,,,741380000A1880,,,,,,,,,,,,,0,,,,,P,prés,,,3,6.056464,45.786671
2019-1094780,2019-09-16,000001,Vente,246350,2441,,RTE DES BAUGES,0025,74540,74138,Gruffy,74,,,741380000A1668,,,9,,,,,,,,,,1,3,Dépendance,,0,,,,,,6.054678,45.789076
2019-1094780,2019-09-16,000001,Vente,246350,2441,,RTE DES BAUGES,0025,74540,74138,Gruffy,74,,,741380000A1668,,,10,,,,,,,,,,1,3,Dépendance,,0,,,,,,6.054678,45.789076
2019-1094780,2019-09-16,000001,Vente,246350,2441,,RTE DES BAUGES,0025,74540,74138,Gruffy,74,,,741380000A1668,,,1,82.75,4,,,,,,,,2,2,Appartement,82,4,,,,,,6.054678,45.789076
2019-1095095,2019-10-01,000001,Vente,90000,,,LES GRANGES,B150,74540,74138,Gruffy,74,,,741380000A0562,,,,,,,,,,,,,0,,,,,S,sols,,,381,6.053872,45.789237
2019-1097149,2019-12-06,000001,Vente,222200,102,,RTE D'ALBY,0005,74540,74138,Gruffy,74,,,741380000A1734,,,11,,32,,,,,,,,2,2,Appartement,69,4,,,,,,6.053725,45.788154
2019-1097149,2019-12-06,000001,Vente,222200,102,,RTE D'ALBY,0005,74540,74138,Gruffy,74,,,741380000A1734,,,11,,32,,,,,,,,2,3,Dépendance,,0,,,,,,6.053725,45.788154
2019-1097226,2019-11-28,000002,Vente,9500,,,PARQUET NORD,B191,74540,74138,Gruffy,74,,,741380000A2060,,,,,,,,,,,,,0,,,,,T,terres,,,56,6.058604,45.787686
2019-1097612,2019-12-11,000001,Vente,1500,,,SEMINA,B250,74540,74138,Gruffy,74,,,741380000B0813,,,,,,,,,,,,,0,,,,,BR,futaies résineuses,SAPIN,Sapins ou sapinière,5067,6.085848,45.785513
2019-1098441,2019-12-23,000001,Vente,1000,,,LES DANNES,B105,74540,74138,Gruffy,74,,,741380000B0633,,,,,,,,,,,,,0,,,,,BR,futaies résineuses,SAPIN,Sapins ou sapinière,5562,6.073349,45.79309
