id_mutation,date_mutation,numero_disposition,nature_mutation,valeur_fonciere,adresse_numero,adresse_suffixe,adresse_nom_voie,adresse_code_voie,code_postal,code_commune,nom_commune,code_departement,ancien_code_commune,ancien_nom_commune,id_parcelle,ancien_id_parcelle,numero_volume,lot1_numero,lot1_surface_carrez,lot2_numero,lot2_surface_carrez,lot3_numero,lot3_surface_carrez,lot4_numero,lot4_surface_carrez,lot5_numero,lot5_surface_carrez,nombre_lots,code_type_local,type_local,surface_reelle_bati,nombre_pieces_principales,code_nature_culture,nature_culture,code_nature_culture_speciale,nature_culture_speciale,surface_terrain,longitude,latitude
2019-1085281,2019-01-04,000001,Vente,78470,4,,CLR DES TERRASSES,0310,74210,74234,Saint-Ferréol,74,,,742340000C0627,,,,,,,,,,,,,0,1,Maison,24,1,S,sols,,,58,6.305305,45.766764
2019-1085531,2019-01-21,000001,Vente,109620,,,LA CHAPELLE,B037,74210,74234,Saint-Ferréol,74,,,742340000C2792,,,,,,,,,,,,,0,,,,,L,landes,,,1145,6.313978,45.762637
2019-1085531,2019-01-21,000001,Vente,109620,,,LA CHAPELLE,B037,74210,74234,Saint-Ferréol,74,,,742340000C2794,,,,,,,,,,,,,0,,,,,BR,futaies résineuses,SAPIN,Sapins ou sapinière,745,6.313838,45.762519
2019-1085886,2019-01-31,000001,Vente,140510,1685,,RTE DES COMBES,0096,74210,74234,Saint-Ferréol,74,,,742340000A2114,,,1,,,,,,,,,,1,2,Appartement,53,2,,,,,,6.312581,45.788788
2019-1086195,2019-02-06,000001,Vente,1269,,,LES GRANDS PRES,B115,74210,74234,Saint-Ferréol,74,,,742340000C3023,,,,,,,,,,,,,0,,,,,P,prés,,,1147,6.318276,45.759567
2019-1086195,2019-02-06,000001,Vente,1269,,,LES GRANGETTES,B119,74210,74234,Saint-Ferréol,74,,,742340000C3024,,,,,,,,,,,,,0,,,,,P,prés,,,122,6.317755,45.759557
2019-1086402,2019-02-20,000001,Echange,300,,,LA LAVANCHE,B129,74210,74234,Saint-Ferréol,74,,,742340000C1292,,,,,,,,,,,,,0,,,,,S,sols,,,154,6.301046,45.773524
2019-1086402,2019-02-20,000002,Echange,300,,,LA LAVANCHE,B129,74210,74234,Saint-Ferréol,74,,,742340000C1280,,,,,,,,,,,,,0,,,,,J,jardins,,,296,6.301032,45.772629
2019-1086438,2019-02-07,000001,Vente,401600,238,,RUE DU CHAMP CANON,0050,74210,74234,Saint-Ferréol,74,,,742340000C2010,,,,,,,,,,,,,0,1,Maison,169,4,S,sols,,,1144,6.309155,45.764245
2019-1086992,2019-03-05,000002,Vente,430,,,SOUS LES ESSERIEUX,B217,74210,74234,Saint-Ferréol,74,,,742340000A2323,,,,,,,,,,,,,0,,,,,BT,taillis simples,,,286,6.321136,45.789137
2019-1086992,2019-03-05,000003,Vente,430,,,SOUS LES ESSERIEUX,B217,74210,74234,Saint-Ferréol,74,,,742340000A2323,,,,,,,,,,,,,0,,,,,BT,taillis simples,,,286,6.321136,45.789137
2019-1087043,2019-02-06,000002,Vente,13800,,,LE ROIBET,B199,74210,74234,Saint-Ferréol,74,,,742340000C2617,,,,,,,,,,,,,0,,,,,P,prés,,,11,6.317724,45.759669
2019-1087043,2019-02-06,000002,Vente,13800,,,LE ROIBET,B199,74210,74234,Saint-Ferréol,74,,,742340000C3016,,,,,,,,,,,,,0,,,,,P,prés,,,19,6.317647,45.75965
2019-1087043,2019-02-06,000002,Vente,13800,,,LE ROIBET,B199,74210,74234,Saint-Ferréol,74,,,742340000C3018,,,,,,,,,,,,,0,,,,,L,landes,,,1,6.318247,45.759983
2019-1087043,2019-02-06,000002,Vente,13800,,,LE ROIBET,B199,74210,74234,Saint-Ferréol,74,,,742340000C3020,,,,,,,,,,,,,0,,,,,P,prés,,,269,6.317907,45.759699
2019-1087043,2019-02-06,000002,Vente,13800,,,LE ROIBET,B199,74210,74234,Saint-Ferréol,74,,,742340000C3022,,,,,,,,,,,,,0,,,,,L,landes,,,45,6.318191,45.760058
2019-1087044,2019-02-06,000003,Vente,440,,,LE ROIBET,B199,74210,74234,Saint-Ferréol,74,,,742340000C3026,,,,,,,,,,,,,0,,,,,S,sols,,,5,6.318241,45.759921
2019-1087044,2019-02-06,000003,Vente,440,,,LE ROIBET,B199,74210,74234,Saint-Ferréol,74,,,742340000C3027,,,,,,,,,,,,,0,,,,,S,sols,,,6,6.3182,45.759865
2019-1087049,2019-03-04,000002,Vente,1770,,,LES GRANGES NORD,B117,74210,74234,Saint-Ferréol,74,,,742340000C1047,,,,,,,,,,,,,0,,,,,P,prés,,,72,6.305078,45.777351
2019-1087049,2019-03-04,000002,Vente,1770,,,LES GRANGES NORD,B117,74210,74234,Saint-Ferréol,74,,,742340000C3036,,,,,,,,,,,,,0,,,,,VE,vergers,,,1698,6.304957,45.77726
2019-1087217,2019-02-22,000001,Vente,100000,239,,CHEM DE PRE CORBET,0265,74210,74234,Saint-Ferréol,74,,,742340000C1849,,,,,,,,,,,,,0,3,Dépendance,,0,S,sols,,,1083,6.303069,45.764882
2019-1087217,2019-02-22,000001,Vente,100000,239,,CHEM DE PRE CORBET,0265,74210,74234,Saint-Ferréol,74,,,742340000C1849,,,,,,,,,,,,,0,1,Maison,85,5,S,sols,,,1083,6.303069,45.764882
2019-1087460,2019-03-08,000001,Vente,174500,12,,RUE DE LA FRUITIERE,0150,74210,74234,Saint-Ferréol,74,,,742340000C0564,,,,,,,,,,,,,0,2,Appartement,50,3,S,sols,,,875,6.30617,45.765708
2019-1087460,2019-03-08,000001,Vente,174500,12,,RUE DE LA FRUITIERE,0150,74210,74234,Saint-Ferréol,74,,,742340000C0564,,,,,,,,,,,,,0,2,Appartement,86,3,S,sols,,,875,6.30617,45.765708
2019-1087460,2019-03-08,000001,Vente,174500,12,,RUE DE LA FRUITIERE,0150,74210,74234,Saint-Ferréol,74,,,742340000C0564,,,,,,,,,,,,,0,3,Dépendance,,0,S,sols,,,875,6.30617,45.765708
2019-1087460,2019-03-08,000001,Vente,174500,12,,RUE DE LA FRUITIERE,0150,74210,74234,Saint-Ferréol,74,,,742340000C0564,,,,,,,,,,,,,0,3,Dépendance,,0,S,sols,,,875,6.30617,45.765708
2019-1087460,2019-03-08,000001,Vente,174500,12,,RUE DE LA FRUITIERE,0150,74210,74234,Saint-Ferréol,74,,,742340000C0564,,,,,,,,,,,,,0,2,Appartement,32,1,S,sols,,,875,6.30617,45.765708
2019-1087460,2019-03-08,000001,Vente,174500,12,,RUE DE LA FRUITIERE,0150,74210,74234,Saint-Ferréol,74,,,742340000C0564,,,,,,,,,,,,,0,3,Dépendance,,0,S,sols,,,875,6.30617,45.765708
2019-1088805,2019-04-17,000001,Vente,215000,277,,RUE DU CHAMP CANON,0050,74210,74234,Saint-Ferréol,74,,,742340000C1813,,,3,,,,,,,,,,1,3,Dépendance,,0,,,,,,6.31027,45.764359
2019-1088805,2019-04-17,000001,Vente,215000,277,,RUE DU CHAMP CANON,0050,74210,74234,Saint-Ferréol,74,,,742340000C1813,,,1,,5,63,6,,,,,,3,2,Appartement,73,3,,,,,,6.31027,45.764359
2019-1088805,2019-04-17,000001,Vente,215000,277,,RUE DU CHAMP CANON,0050,74210,74234,Saint-Ferréol,74,,,742340000C1813,,,2,,4,69,,,,,,,2,2,Appartement,73,3,,,,,,6.31027,45.764359
2019-1090448,2019-06-07,000002,Vente,248000,645,,RUE DU CHAMP CANON,0050,74210,74234,Saint-Ferréol,74,,,742340000C3038,,,,,,,,,,,,,0,3,Dépendance,,0,S,sols,,,664,6.31334,45.762093
2019-1090448,2019-06-07,000002,Vente,248000,645,,RUE DU CHAMP CANON,0050,74210,74234,Saint-Ferréol,74,,,742340000C3038,,,,,,,,,,,,,0,1,Maison,73,6,S,sols,,,664,6.31334,45.762093
2019-1090625,2019-05-28,000001,Vente,35600,161,,ALL DES EDELWEISS,0120,74210,74234,Saint-Ferréol,74,,,742340000C2911,,2,,,,,,,,,,,0,,,,,,,,,,6.311757,45.763859
2019-1090629,2019-05-28,000001,Vente,301900,161,,ALL DES EDELWEISS,0120,74210,74234,Saint-Ferréol,74,,,742340000C2911,,1,,,,,,,,,,,0,,,,,,,,,,6.311757,45.763859
2019-1090636,2019-05-28,000001,Vente,17500,,,CHAMP CANON,B031,74210,74234,Saint-Ferréol,74,,,742340000C3041,,,,,,,,,,,,,0,,,,,S,sols,,,658,6.311053,45.76416
2019-1091088,2019-06-07,000001,Vente,165000,,,LA COMBAZ SUD,B056,74210,74234,Saint-Ferréol,74,,,742340000A1267,,,,,,,,,,,,,0,,,,,S,sols,,,33,6.308771,45.784492
2019-1091088,2019-06-07,000001,Vente,165000,5028,,LA COMBAZ SUD,B056,74210,74234,Saint-Ferréol,74,,,742340000A1268,,,,,,,,,,,,,0,1,Maison,36,2,S,sols,,,465,6.308662,45.78443
2019-1091088,2019-06-07,000001,Vente,165000,,,LA COMBAZ SUD,B056,74210,74234,Saint-Ferréol,74,,,742340000A1277,,,,,,,,,,,,,0,,,,,S,sols,,,13,6.308703,45.78428
2019-1091088,2019-06-07,000001,Vente,165000,,,LA COMBAZ SUD,B056,74210,74234,Saint-Ferréol,74,,,742340000A1278,,,,,,,,,,,,,0,,,,,VE,vergers,,,2410,6.308778,45.784189
2019-1091088,2019-06-07,000001,Vente,165000,,,FORNALEY,B094,74210,74234,Saint-Ferréol,74,,,742340000A1440,,,,,,,,,,,,,0,,,,,BT,taillis simples,,,13,6.307977,45.783789
2019-1091088,2019-06-07,000001,Vente,165000,,,FORNALEY,B094,74210,74234,Saint-Ferréol,74,,,742340000A1441,,,,,,,,,,,,,0,,,,,BT,taillis simples,,,2106,6.307666,45.783661
2019-1091399,2019-06-20,000001,Vente,40230,,,LA CHAPELLE,B037,74210,74234,Saint-Ferréol,74,,,742340000C2794,,,,,,,,,,,,,0,,,,,BR,futaies résineuses,SAPIN,Sapins ou sapinière,745,6.313838,45.762519
2019-1094133,2019-09-11,000001,Vente,250000,446,,RUE DU CHAMP CANON,0050,74210,74234,Saint-Ferréol,74,,,742340000C1843,,,,,,,,,,,,,0,2,Appartement,50,3,S,sols,,,1212,6.311132,45.762746
2019-1094133,2019-09-11,000001,Vente,250000,446,,RUE DU CHAMP CANON,0050,74210,74234,Saint-Ferréol,74,,,742340000C1843,,,,,,,,,,,,,0,1,Maison,73,4,S,sols,,,1212,6.311132,45.762746
2019-1094858,2019-10-04,000001,Vente,294800,,,LA COMBAZ NORD,B054,74210,74234,Saint-Ferréol,74,,,742340000A1029,,,,,,,,,,,,,0,,,,,P,prés,,,247,6.309569,45.784605
2019-1094858,2019-10-04,000001,Vente,294800,340,,IMP DE LA COMBAZ,0093,74210,74234,Saint-Ferréol,74,,,742340000A1030,,,,,,,,,,,,,0,1,Maison,136,5,S,sols,,,787,6.309771,45.784761
2019-1094858,2019-10-04,000001,Vente,294800,,,LES QUOEX,B181,74210,74234,Saint-Ferréol,74,,,742340000A1092,,,,,,,,,,,,,0,,,,,P,prés,,,104,6.30995,45.784851
2019-1094858,2019-10-04,000001,Vente,294800,,,LES QUOEX,B181,74210,74234,Saint-Ferréol,74,,,742340000A1093,,,,,,,,,,,,,0,,,,,S,sols,,,39,6.309938,45.784604
2019-1094858,2019-10-04,000001,Vente,294800,,,LES QUOEX,B181,74210,74234,Saint-Ferréol,74,,,742340000A1094,,,,,,,,,,,,,0,,,,,L,landes,,,838,6.310038,45.784668
2019-1094858,2019-10-04,000001,Vente,294800,,,LES QUOEX,B181,74210,74234,Saint-Ferréol,74,,,742340000A1097,,,,,,,,,,,,,0,,,,,P,prés,,,75,6.310391,45.78465
2019-1094858,2019-10-04,000001,Vente,294800,,,LA COMBAZ SUD,B056,74210,74234,Saint-Ferréol,74,,,742340000A1261,,,,,,,,,,,,,0,,,,,S,sols,,,304,6.309648,45.784518
2019-1095126,2019-10-03,000001,Echange,128,,,VIGNES DU PISSIEU,B245,74210,74234,Saint-Ferréol,74,,,742340000B0704,,,,,,,,,,,,,0,,,,,P,prés,,,363,6.326166,45.762137
2019-1095126,2019-10-03,000001,Echange,128,,,VIGNES DU CHENAY,B244,74210,74234,Saint-Ferréol,74,,,742340000B0705,,,,,,,,,,,,,0,,,,,P,prés,,,354,6.326072,45.76213
2019-1095126,2019-10-03,000001,Echange,128,,,VIGNES DU CHENAY,B244,74210,74234,Saint-Ferréol,74,,,742340000B0706,,,,,,,,,,,,,0,,,,,BT,taillis simples,,,563,6.325921,45.762926
2019-1095126,2019-10-03,000002,Echange,128,,,VIGNES DU CHENAY,B244,74210,74234,Saint-Ferréol,74,,,742340000B0733,,,,,,,,,,,,,0,,,,,P,prés,,,1224,6.323278,45.762274
2019-1096487,2019-11-07,000002,Echange,500,,,SOUS LESCHAUX NORD,B224,74210,74234,Saint-Ferréol,74,,,742340000A0492,,,,,,,,,,,,,0,,,,,BT,taillis simples,,,914,6.316596,45.79104
2019-1096487,2019-11-07,000002,Echange,500,,,SOUS LESCHAUX NORD,B224,74210,74234,Saint-Ferréol,74,,,742340000A0494,,,,,,,,,,,,,0,,,,,BT,taillis simples,,,9358,6.317106,45.791677
2019-1096595,2019-10-31,000001,Vente,73000,645,,RUE DU CHAMP CANON,0050,74210,74234,Saint-Ferréol,74,,,742340000C3039,,,,,,,,,,,,,0,,,,,AB,terrains a bâtir,,,263,6.313517,45.762229
2019-1096595,2019-10-31,000001,Vente,73000,645,,RUE DU CHAMP CANON,0050,74210,74234,Saint-Ferréol,74,,,742340000C3040,,,,,,,,,,,,,0,,,,,AB,terrains a bâtir,,,263,6.313659,45.762297
2019-1096699,2019-11-07,000001,Vente,200000,,,LESCHAUX,B131,74210,74234,Saint-Ferréol,74,,,742340000A0496,,,,,,,,,,,,,0,,,,,P,prés,,,929,6.317862,45.791586
2019-1096699,2019-11-07,000001,Vente,200000,,,LESCHAUX,B131,74210,74234,Saint-Ferréol,74,,,742340000A2154,,,,,,,,,,,,,0,,,,,P,prés,,,857,6.318087,45.791485
2019-1096699,2019-11-07,000001,Vente,200000,581,,RTE DE LESCHAUX,0196,74210,74234,Saint-Ferréol,74,,,742340000A2155,,,,,,,,,,,,,0,1,Maison,61,3,S,sols,,,215,6.318212,45.791213
2019-1097058,2019-11-19,000001,Vente,238100,1,,ALL DES PRIMEVERES,0280,74210,74234,Saint-Ferréol,74,,,742340000C2317,,,10,,,,,,,,,,1,3,Dépendance,,0,,,,,,6.315859,45.760215
2019-1097058,2019-11-19,000001,Vente,238100,1,,ALL DES PRIMEVERES,0280,74210,74234,Saint-Ferréol,74,,,742340000C2317,,,1,,2,,,,,,,,2,2,Appartement,101,6,,,,,,6.315859,45.760215
2019-1098735,2019-12-26,000001,Vente,185050,,,SOUS LESCHAUX NORD,B224,74210,74234,Saint-Ferréol,74,,,742340000A0486,,,,,,,,,,,,,0,,,,,P,prés,,,996,6.318063,45.791159
2019-1098735,2019-12-26,000001,Vente,185050,,,LESCHAUX,B131,74210,74234,Saint-Ferréol,74,,,742340000A0515,,,,,,,,,,,,,0,,,,,S,sols,,,207,6.318665,45.791134
2019-1098735,2019-12-26,000001,Vente,185050,566,,RTE DE LESCHAUX,0196,74210,74234,Saint-Ferréol,74,,,742340000A0516,,,,,,,,,,,,,0,1,Maison,42,3,S,sols,,,72,6.318438,45.791139
2019-1098735,2019-12-26,000001,Vente,185050,566,,RTE DE LESCHAUX,0196,74210,74234,Saint-Ferréol,74,,,742340000A0517,,,,,,,,,,,,,0,1,Maison,32,1,S,sols,,,162,6.318458,45.791187
2019-1098948,2019-12-13,000001,Vente,147870,31,,RUE DU CHENAY LE VIEUX,0080,74210,74234,Saint-Ferréol,74,,,742340000B1926,,2,,,,,,,,,,,0,,,,,,,,,,6.32441,45.761205
2019-1098948,2019-12-13,000001,Vente,147870,,,LE CHENAY,B042,74210,74234,Saint-Ferréol,74,,,742340000B1973,,1,,,,,,,,,,,0,,,,,,,,,,6.324548,45.761249
2019-1098948,2019-12-13,000001,Vente,147870,,,LE CHENAY,B042,74210,74234,Saint-Ferréol,74,,,742340000B1974,,,,,,,,,,,,,0,,,,,S,sols,,,726,6.324498,45.761146
2019-1098948,2019-12-13,000001,Vente,147870,,,LE CHENAY,B042,74210,74234,Saint-Ferréol,74,,,742340000B1975,,1,,,,,,,,,,,0,,,,,,,,,,6.324558,45.761212
