id_mutation,date_mutation,numero_disposition,nature_mutation,valeur_fonciere,adresse_numero,adresse_suffixe,adresse_nom_voie,adresse_code_voie,code_postal,code_commune,nom_commune,code_departement,ancien_code_commune,ancien_nom_commune,id_parcelle,ancien_id_parcelle,numero_volume,lot1_numero,lot1_surface_carrez,lot2_numero,lot2_surface_carrez,lot3_numero,lot3_surface_carrez,lot4_numero,lot4_surface_carrez,lot5_numero,lot5_surface_carrez,nombre_lots,code_type_local,type_local,surface_reelle_bati,nombre_pieces_principales,code_nature_culture,nature_culture,code_nature_culture_speciale,nature_culture_speciale,surface_terrain,longitude,latitude
2019-1120436,2019-04-18,000001,Vente,52252,,,LOUMARE,B013,76190,76223,Écalles-Alix,76,,,76223000ZA0007,,,,,,,,,,,,,0,,,,,T,terres,,,38325,0.799162,49.636134
2019-1120436,2019-04-18,000001,Vente,52252,,,LOUMARE,B013,76190,76223,Écalles-Alix,76,,,76223000ZA0011,,,,,,,,,,,,,0,,,,,T,terres,,,36321,0.798596,49.632348
2019-1120493,2019-05-06,000001,Vente,65000,,,L EGLISE,B008,76190,76223,Écalles-Alix,76,,,762230000A0538,,,,,,,,,,,,,0,,,,,AB,terrains a bâtir,,,573,0.821452,49.617224
2019-1120532,2019-05-07,000002,Vente,290,,,LE MOULIN,B015,76190,76223,Écalles-Alix,76,,,76223000ZC0082,,,,,,,,,,,,,0,,,,,L,landes,,,5716,0.824214,49.620572
2019-1120532,2019-05-07,000002,Vente,290,,,LE MOULIN,B015,76190,76223,Écalles-Alix,76,,,76223000ZC0083,,,,,,,,,,,,,0,,,,,L,landes,,,284,0.824362,49.620653
2019-1120866,2019-05-20,000002,Vente,266350,150,,IMP DE LA GRANDE RUE,0082,76190,76223,Écalles-Alix,76,,,762230000B0373,,,,,,,,,,,,,0,1,Maison,100,4,,,,,,0.815677,49.603668
2019-1120887,2019-05-29,000001,Vente,52000,,,L EGLISE,B008,76190,76223,Écalles-Alix,76,,,762230000A0546,,,,,,,,,,,,,0,,,,,AB,terrains a bâtir,,,472,0.821919,49.616624
2019-1121049,2019-06-13,000001,Vente,55000,,,L EGLISE,B008,76190,76223,Écalles-Alix,76,,,762230000A0551,,,,,,,,,,,,,0,,,,,AB,terrains a bâtir,,,611,0.82183,49.617227
2019-1121478,2019-06-29,000001,Vente,49391,9007,,LA GRAND ROUTE,B010,76190,76223,Écalles-Alix,76,,,76223000ZH0023,,,,,,,,,,,,,0,,,,,T,terres,,,18709,0.828259,49.620044
2019-1121478,2019-06-29,000001,Vente,49391,9008,,LA GRAND ROUTE,B010,76190,76223,Écalles-Alix,76,,,76223000ZH0024,,,,,,,,,,,,,0,,,,,T,terres,,,15599,0.829856,49.619133
2019-1121478,2019-06-29,000001,Vente,49391,9009,,LA GRAND ROUTE,B010,76190,76223,Écalles-Alix,76,,,76223000ZH0034,,,,,,,,,,,,,0,,,,,P,prés,,,6851,0.831936,49.618388
2019-1121877,2019-07-30,000001,Vente,60000,171,,RUE DE LA GRANGE,0085,76190,76223,Écalles-Alix,76,,,762230000A0537,,,,,,,,,,,,,0,1,Maison,89,4,S,sols,,,546,0.821545,49.617414
2019-1121890,2019-08-01,000001,Vente,61000,,,L EGLISE,B008,76190,76223,Écalles-Alix,76,,,762230000A0539,,,,,,,,,,,,,0,,,,,AB,terrains a bâtir,,,611,0.821326,49.61706
2019-1121897,2019-08-07,000001,Vente,50000,,,L EGLISE,B008,76190,76223,Écalles-Alix,76,,,762230000A0548,,,,,,,,,,,,,0,,,,,AB,terrains a bâtir,,,561,0.821936,49.616838
2019-1121899,2019-08-02,000001,Vente,53000,,,L EGLISE,B008,76190,76223,Écalles-Alix,76,,,762230000A0550,,,,,,,,,,,,,0,,,,,AB,terrains a bâtir,,,591,0.821779,49.617046
2019-1122204,2019-09-04,000001,Vente,70683.62,,,L EGLISE,B008,76190,76223,Écalles-Alix,76,,,762230000A0543,,,,,,,,,,,,,0,,,,,AB,terrains a bâtir,,,1953,0.821242,49.616458
2019-1122618,2019-10-02,000001,Vente,65000,,,L EGLISE,B008,76190,76223,Écalles-Alix,76,,,762230000A0540,,,,,,,,,,,,,0,,,,,AB,terrains a bâtir,,,626,0.821252,49.616892
2019-1122728,2019-10-15,000001,Vente,52000,185,,RUE DE LA GRANGE,0085,76190,76223,Écalles-Alix,76,,,762230000A0536,,,,,,,,,,,,,0,1,Maison,96,4,S,sols,,,600,0.821628,49.617576
2019-1123016,2019-10-31,000001,Vente,140000,220,,CHE DES FERMES,0065,76190,76223,Écalles-Alix,76,,,762230000C0241,,,,,,,,,,,,,0,1,Maison,156,5,S,sols,,,500,0.810275,49.616214
2019-1123016,2019-10-31,000001,Vente,140000,220,,CHE DES FERMES,0065,76190,76223,Écalles-Alix,76,,,762230000C0241,,,,,,,,,,,,,0,1,Maison,156,5,AG,terrains d'agrément,,,2776,0.810275,49.616214
2019-1123417,2019-11-26,000001,Vente,7992,9006,,LA GRAND ROUTE,B010,76190,76223,Écalles-Alix,76,,,76223000ZH0022,,,,,,,,,,,,,0,,,,,T,terres,,,6660,0.826813,49.620826
2019-1123493,2019-12-12,000001,Vente,122100,88,,RUE DU BOURG,0027,76190,76223,Écalles-Alix,76,,,762230000B0205,,,,,,,,,,,,,0,1,Maison,104,5,S,sols,,,500,0.82355,49.615159
2019-1123493,2019-12-12,000001,Vente,122100,88,,RUE DU BOURG,0027,76190,76223,Écalles-Alix,76,,,762230000B0205,,,,,,,,,,,,,0,1,Maison,104,5,AG,terrains d'agrément,,,1434,0.82355,49.615159
2019-1123521,2019-12-12,000001,Vente,45300,,,LA BRIQUETERIE,B006,76190,76223,Écalles-Alix,76,,,76223000ZD0019,,,,,,,,,,,,,0,,,,,P,prés,,,12955,0.81677,49.611564
2019-1123521,2019-12-12,000001,Vente,45300,,,LA BRIQUETERIE,B006,76190,76223,Écalles-Alix,76,,,76223000ZD0019,,,,,,,,,,,,,0,,,,,P,prés,,,12955,0.81677,49.611564
2019-1123640,2019-12-18,000001,Vente,192589,8,,PL DE LA FERME,0063,76190,76223,Écalles-Alix,76,,,76223000ZC0051,,,,,,,,,,,,,0,1,Maison,111,6,S,sols,,,927,0.821731,49.618248
2019-1123783,2019-12-23,000001,Vente,54000,80,,RUE DE LA GRANGE,0085,76190,76223,Écalles-Alix,76,,,762230000A0549,,,,,,,,,,,,,0,1,Maison,94,4,S,sols,,,500,0.821636,49.616866
2019-1123800,2019-12-26,000001,Vente,49000,,,L EGLISE,B008,76190,76223,Écalles-Alix,76,,,762230000A0547,,,,,,,,,,,,,0,,,,,AB,terrains a bâtir,,,514,0.821986,49.616722
2019-1123824,2019-10-11,000001,Adjudication,85000,154,,RUE DU BOURG,0027,76190,76223,Écalles-Alix,76,,,762230000B0289,,,,,,,,,,,,,0,1,Maison,87,5,AG,terrains d'agrément,,,1265,0.823724,49.61477
2019-1123824,2019-10-11,000001,Adjudication,85000,154,,RUE DU BOURG,0027,76190,76223,Écalles-Alix,76,,,762230000B0289,,,,,,,,,,,,,0,1,Maison,87,5,S,sols,,,500,0.823724,49.61477
2019-1123824,2019-10-11,000001,Adjudication,85000,,,L EGLISE,B008,76190,76223,Écalles-Alix,76,,,762230000B0292,,,,,,,,,,,,,0,,,,,S,sols,,,87,0.824389,49.615011
